﻿2026-07-29T09:51:04.1812538Z Current runner version: '2.336.0'
2026-07-29T09:51:04.1817234Z Runner name: 'kitsubito'
2026-07-29T09:51:04.1817760Z Runner group name: 'Default'
2026-07-29T09:51:04.1818412Z Machine name: 'KITSUBITO'
2026-07-29T09:51:04.1821783Z ##[group]GITHUB_TOKEN Permissions
2026-07-29T09:51:04.1823902Z Actions: write
2026-07-29T09:51:04.1824307Z ArtifactMetadata: write
2026-07-29T09:51:04.1824708Z Attestations: write
2026-07-29T09:51:04.1825091Z Checks: write
2026-07-29T09:51:04.1825444Z CodeQuality: write
2026-07-29T09:51:04.1825812Z Contents: write
2026-07-29T09:51:04.1826174Z CopilotRequests: write
2026-07-29T09:51:04.1826574Z Deployments: write
2026-07-29T09:51:04.1826936Z Discussions: write
2026-07-29T09:51:04.1827304Z Drives: write
2026-07-29T09:51:04.1827643Z Issues: write
2026-07-29T09:51:04.1828005Z Metadata: read
2026-07-29T09:51:04.1828349Z Models: read
2026-07-29T09:51:04.1828700Z Packages: write
2026-07-29T09:51:04.1829200Z Pages: write
2026-07-29T09:51:04.1829691Z PullRequests: write
2026-07-29T09:51:04.1830097Z RepositoryProjects: write
2026-07-29T09:51:04.1830497Z SecurityEvents: write
2026-07-29T09:51:04.1830868Z Statuses: write
2026-07-29T09:51:04.1831224Z VulnerabilityAlerts: read
2026-07-29T09:51:04.1831610Z ##[endgroup]
2026-07-29T09:51:04.1833427Z Secret source: Actions
2026-07-29T09:51:04.1834119Z Prepare workflow directory
2026-07-29T09:51:04.2193856Z Prepare all required actions
2026-07-29T09:51:04.2231039Z Getting action download info
2026-07-29T09:51:04.5656450Z Download action repository 'actions/checkout@v5' (SHA:fbc6f3992d24b796d5a048ff273f7fcc4a7b6c09)
2026-07-29T09:51:05.1154512Z Complete job name: unit (self-hosted, Linux, kitsubito)
2026-07-29T09:51:05.2021103Z ##[group]Run set -euo pipefail
2026-07-29T09:51:05.2021680Z [36;1mset -euo pipefail[0m
2026-07-29T09:51:05.2022134Z [36;1mfloor_bytes=$((32 * 1024 * 1024 * 1024))[0m
2026-07-29T09:51:05.2022725Z [36;1mdrive=$(df -P "$GITHUB_WORKSPACE" | awk 'NR == 2 { print $1 }')[0m
2026-07-29T09:51:05.2023416Z [36;1mfree_bytes=$(df -PB1 "$GITHUB_WORKSPACE" | awk 'NR == 2 { print $4 }')[0m
2026-07-29T09:51:05.2024144Z [36;1mprintf 'disk preflight: drive=%s free_bytes=%s floor_bytes=%s\n' \[0m
2026-07-29T09:51:05.2024748Z [36;1m  "$drive" "$free_bytes" "$floor_bytes"[0m
2026-07-29T09:51:05.2025263Z [36;1mif [ "$free_bytes" -lt "$floor_bytes" ]; then[0m
2026-07-29T09:51:05.2026082Z [36;1m  echo "::error title=Insufficient free disk::RESOURCE=disk drive=$drive free_bytes=$free_bytes floor_bytes=$floor_bytes"[0m
2026-07-29T09:51:05.2026859Z [36;1m  exit 1[0m
2026-07-29T09:51:05.2027200Z [36;1mfi[0m
2026-07-29T09:51:05.2043754Z shell: /usr/bin/bash --noprofile --norc -e -o pipefail {0}
2026-07-29T09:51:05.2044513Z ##[endgroup]
2026-07-29T09:51:05.2166898Z disk preflight: drive=/dev/nvme0n1p2 free_bytes=756168880128 floor_bytes=34359738368
2026-07-29T09:51:05.2335165Z ##[group]Run actions/checkout@v5
2026-07-29T09:51:05.2335639Z with:
2026-07-29T09:51:05.2336009Z   repository: BigscreenVR/spt-bs-core
2026-07-29T09:51:05.2339138Z   token: ***
2026-07-29T09:51:05.2339506Z   ssh-strict: true
2026-07-29T09:51:05.2339892Z   ssh-user: git
2026-07-29T09:51:05.2340253Z   persist-credentials: true
2026-07-29T09:51:05.2340635Z   clean: true
2026-07-29T09:51:05.2340983Z   sparse-checkout-cone-mode: true
2026-07-29T09:51:05.2341399Z   fetch-depth: 1
2026-07-29T09:51:05.2341758Z   fetch-tags: false
2026-07-29T09:51:05.2342110Z   show-progress: true
2026-07-29T09:51:05.2342472Z   lfs: false
2026-07-29T09:51:05.2342801Z   submodules: false
2026-07-29T09:51:05.2343163Z   set-safe-directory: true
2026-07-29T09:51:05.2343563Z   allow-unsafe-pr-checkout: false
2026-07-29T09:51:05.2343961Z ##[endgroup]
2026-07-29T09:51:05.3139782Z Syncing repository: BigscreenVR/spt-bs-core
2026-07-29T09:51:05.3141586Z ##[group]Getting Git version info
2026-07-29T09:51:05.3142344Z Working directory is '/home/reavus/actions-runner/_work/spt-bs-core/spt-bs-core'
2026-07-29T09:51:05.3143241Z [command]/usr/bin/git version
2026-07-29T09:51:05.3144063Z git version 2.43.0
2026-07-29T09:51:05.3160288Z ##[endgroup]
2026-07-29T09:51:05.3170819Z Temporarily overriding HOME='/home/reavus/actions-runner/_work/_temp/97a80f3a-254b-4605-9ac6-7fc18107d9d2' before making global git config changes
2026-07-29T09:51:05.3172087Z Adding repository directory to the temporary git global config as a safe directory
2026-07-29T09:51:05.3173844Z [command]/usr/bin/git config --global --add safe.directory /home/reavus/actions-runner/_work/spt-bs-core/spt-bs-core
2026-07-29T09:51:05.3204862Z [command]/usr/bin/git config --local --get remote.origin.url
2026-07-29T09:51:05.3224956Z https://github.com/BigscreenVR/spt-bs-core
2026-07-29T09:51:05.3237853Z ##[group]Removing previously created refs, to avoid conflicts
2026-07-29T09:51:05.3240563Z [command]/usr/bin/git rev-parse --symbolic-full-name --verify --quiet HEAD
2026-07-29T09:51:05.3261235Z HEAD
2026-07-29T09:51:05.3295177Z ##[endgroup]
2026-07-29T09:51:05.3296821Z [command]/usr/bin/git submodule status
2026-07-29T09:51:05.3484869Z ##[group]Cleaning the repository
2026-07-29T09:51:05.3521827Z [command]/usr/bin/git clean -ffdx
2026-07-29T09:51:05.8378725Z Removing target/
2026-07-29T09:51:05.8387294Z [command]/usr/bin/git reset --hard HEAD
2026-07-29T09:51:05.8447999Z HEAD is now at 5aa12467 Merge b1801eab79e7c4cf5bbf665abdda9b5e468e83d9 into ffc7e9ea4427ff56f02edd6816b814cea5874dfe
2026-07-29T09:51:05.8453627Z ##[endgroup]
2026-07-29T09:51:05.8454890Z ##[group]Disabling automatic garbage collection
2026-07-29T09:51:05.8459094Z [command]/usr/bin/git config --local gc.auto 0
2026-07-29T09:51:05.8487349Z ##[endgroup]
2026-07-29T09:51:05.8488127Z ##[group]Setting up auth
2026-07-29T09:51:05.8492771Z [command]/usr/bin/git config --local --name-only --get-regexp core\.sshCommand
2026-07-29T09:51:05.8517974Z [command]/usr/bin/git submodule foreach --recursive sh -c "git config --local --name-only --get-regexp 'core\.sshCommand' && git config --local --unset-all 'core.sshCommand' || :"
2026-07-29T09:51:05.8710581Z [command]/usr/bin/git config --local --name-only --get-regexp http\.https\:\/\/github\.com\/\.extraheader
2026-07-29T09:51:05.8752936Z [command]/usr/bin/git submodule foreach --recursive sh -c "git config --local --name-only --get-regexp 'http\.https\:\/\/github\.com\/\.extraheader' && git config --local --unset-all 'http.https://github.com/.extraheader' || :"
2026-07-29T09:51:05.8935216Z [command]/usr/bin/git config --local --name-only --get-regexp ^includeIf\.gitdir:
2026-07-29T09:51:05.8962296Z [command]/usr/bin/git submodule foreach --recursive git config --local --show-origin --name-only --get-regexp remote.origin.url
2026-07-29T09:51:05.9150616Z [command]/usr/bin/git config --local http.https://github.com/.extraheader AUTHORIZATION: basic ***
2026-07-29T09:51:05.9181553Z ##[endgroup]
2026-07-29T09:51:05.9182420Z ##[group]Fetching the repository
2026-07-29T09:51:05.9189600Z [command]/usr/bin/git -c protocol.version=2 fetch --no-tags --prune --no-recurse-submodules --depth=1 origin +5aa12467744869a73922a65d1ce611bedb49e576:refs/remotes/pull/119/merge
2026-07-29T09:51:06.3476366Z ##[endgroup]
2026-07-29T09:51:06.3477432Z ##[group]Determining the checkout info
2026-07-29T09:51:06.3478457Z ##[endgroup]
2026-07-29T09:51:06.3487850Z [command]/usr/bin/git sparse-checkout disable
2026-07-29T09:51:06.3528003Z [command]/usr/bin/git config --local --unset-all extensions.worktreeConfig
2026-07-29T09:51:06.3553925Z ##[group]Checking out the ref
2026-07-29T09:51:06.3554984Z [command]/usr/bin/git checkout --progress --force refs/remotes/pull/119/merge
2026-07-29T09:51:06.3601085Z HEAD is now at 5aa12467 Merge b1801eab79e7c4cf5bbf665abdda9b5e468e83d9 into ffc7e9ea4427ff56f02edd6816b814cea5874dfe
2026-07-29T09:51:06.3604684Z ##[endgroup]
2026-07-29T09:51:06.3634964Z [command]/usr/bin/git log -1 --format=%H
2026-07-29T09:51:06.3654758Z 5aa12467744869a73922a65d1ce611bedb49e576
2026-07-29T09:51:06.3820514Z ##[group]Run cargo test --workspace --lib --bins
2026-07-29T09:51:06.3821707Z [36;1mcargo test --workspace --lib --bins[0m
2026-07-29T09:51:06.3836345Z shell: /usr/bin/bash -e {0}
2026-07-29T09:51:06.3837355Z ##[endgroup]
2026-07-29T09:51:06.6740860Z    Compiling proc-macro2 v1.0.106
2026-07-29T09:51:06.6742280Z    Compiling quote v1.0.45
2026-07-29T09:51:06.6743370Z    Compiling unicode-ident v1.0.24
2026-07-29T09:51:06.6744505Z    Compiling libc v0.2.186
2026-07-29T09:51:06.6745612Z    Compiling serde_core v1.0.228
2026-07-29T09:51:06.6746704Z    Compiling cfg-if v1.0.4
2026-07-29T09:51:06.6767166Z    Compiling serde v1.0.228
2026-07-29T09:51:06.6818131Z    Compiling portable-atomic v1.13.1
2026-07-29T09:51:06.6845889Z    Compiling typenum v1.20.1
2026-07-29T09:51:06.6847905Z    Compiling version_check v0.9.5
2026-07-29T09:51:06.6866134Z    Compiling memchr v2.8.1
2026-07-29T09:51:06.6907482Z    Compiling critical-section v1.2.0
2026-07-29T09:51:06.6967986Z    Compiling log v0.4.32
2026-07-29T09:51:06.7082196Z    Compiling find-msvc-tools v0.1.9
2026-07-29T09:51:06.7084476Z    Compiling shlex v2.0.1
2026-07-29T09:51:06.7255544Z    Compiling subtle v2.6.1
2026-07-29T09:51:06.7648066Z    Compiling smallvec v1.15.1
2026-07-29T09:51:06.8105221Z    Compiling equivalent v1.0.2
2026-07-29T09:51:06.8898895Z    Compiling itoa v1.0.18
2026-07-29T09:51:06.9274908Z    Compiling pin-project-lite v0.2.17
2026-07-29T09:51:06.9361740Z    Compiling semver v1.0.28
2026-07-29T09:51:06.9675278Z    Compiling rand_core v0.10.1
2026-07-29T09:51:06.9925292Z    Compiling bitflags v2.12.1
2026-07-29T09:51:07.0164050Z    Compiling getrandom v0.4.2
2026-07-29T09:51:07.0234247Z    Compiling futures-core v0.3.32
2026-07-29T09:51:07.0237413Z    Compiling bytes v1.11.1
2026-07-29T09:51:07.0421434Z    Compiling cpufeatures v0.2.17
2026-07-29T09:51:07.0654124Z    Compiling generic-array v0.14.7
2026-07-29T09:51:07.0984318Z    Compiling hashbrown v0.17.1
2026-07-29T09:51:07.1301682Z    Compiling stable_deref_trait v1.2.1
2026-07-29T09:51:07.1349798Z    Compiling futures-sink v0.3.32
2026-07-29T09:51:07.1673021Z    Compiling slab v0.4.12
2026-07-29T09:51:07.1799551Z    Compiling futures-io v0.3.32
2026-07-29T09:51:07.2334359Z    Compiling futures-channel v0.3.32
2026-07-29T09:51:07.2731451Z    Compiling rustc_version v0.4.1
2026-07-29T09:51:07.2891120Z    Compiling futures-task v0.3.32
2026-07-29T09:51:07.2990753Z    Compiling rustversion v1.0.22
2026-07-29T09:51:07.3171419Z    Compiling fnv v1.0.7
2026-07-29T09:51:07.3681541Z    Compiling strsim v0.11.1
2026-07-29T09:51:07.3951642Z    Compiling cfg_aliases v0.2.1
2026-07-29T09:51:07.4055955Z    Compiling litemap v0.8.2
2026-07-29T09:51:07.4449212Z    Compiling writeable v0.6.3
2026-07-29T09:51:07.4765409Z    Compiling zerocopy v0.8.50
2026-07-29T09:51:07.4930993Z    Compiling ahash v0.8.12
2026-07-29T09:51:07.5121301Z    Compiling icu_normalizer_data v2.2.0
2026-07-29T09:51:07.6651655Z    Compiling icu_properties_data v2.2.0
2026-07-29T09:51:07.6838141Z    Compiling fs_extra v1.3.0
2026-07-29T09:51:07.6969779Z    Compiling ident_case v1.0.1
2026-07-29T09:51:07.6977077Z    Compiling curve25519-dalek v4.1.3
2026-07-29T09:51:07.6979058Z    Compiling utf8_iter v1.0.4
2026-07-29T09:51:07.8710886Z    Compiling dunce v1.0.5
2026-07-29T09:51:07.9130287Z    Compiling indexmap v2.14.0
2026-07-29T09:51:07.9591392Z    Compiling vcpkg v0.2.15
2026-07-29T09:51:07.9619083Z    Compiling autocfg v1.5.1
2026-07-29T09:51:07.9714325Z    Compiling pkg-config v0.3.33
2026-07-29T09:51:07.9715487Z    Compiling signature v2.2.0
2026-07-29T09:51:07.9800872Z    Compiling zmij v1.0.21
2026-07-29T09:51:08.0776715Z    Compiling syn v2.0.117
2026-07-29T09:51:08.1153045Z    Compiling ed25519 v2.2.3
2026-07-29T09:51:08.1413436Z    Compiling fastrand v2.4.1
2026-07-29T09:51:08.1691308Z    Compiling percent-encoding v2.3.2
2026-07-29T09:51:08.2560629Z    Compiling serde_json v1.0.150
2026-07-29T09:51:08.3271008Z    Compiling http v1.4.1
2026-07-29T09:51:08.3980876Z    Compiling unicode-segmentation v1.13.3
2026-07-29T09:51:08.4082299Z    Compiling cpufeatures v0.3.0
2026-07-29T09:51:08.4350996Z    Compiling thiserror v2.0.18
2026-07-29T09:51:08.4396761Z    Compiling aws-lc-rs v1.17.0
2026-07-29T09:51:08.4651050Z    Compiling jobserver v0.1.34
2026-07-29T09:51:08.5220592Z    Compiling scopeguard v1.2.0
2026-07-29T09:51:08.5411319Z    Compiling fallible-streaming-iterator v0.1.9
2026-07-29T09:51:08.5971812Z    Compiling fallible-iterator v0.3.0
2026-07-29T09:51:08.6351067Z    Compiling lock_api v0.4.14
2026-07-29T09:51:08.6831990Z    Compiling chacha20 v0.10.0
2026-07-29T09:51:08.6954943Z    Compiling form_urlencoded v1.2.2
2026-07-29T09:51:08.7385854Z    Compiling cc v1.2.63
2026-07-29T09:51:08.8050447Z    Compiling crypto-common v0.1.7
2026-07-29T09:51:08.8260946Z    Compiling block-buffer v0.10.4
2026-07-29T09:51:08.9130814Z    Compiling untrusted v0.9.0
2026-07-29T09:51:08.9231222Z    Compiling heck v0.5.0
2026-07-29T09:51:08.9305181Z    Compiling anyhow v1.0.102
2026-07-29T09:51:08.9421014Z    Compiling digest v0.10.7
2026-07-29T09:51:08.9521152Z    Compiling rustls v0.23.40
2026-07-29T09:51:08.9543633Z    Compiling convert_case v0.10.0
2026-07-29T09:51:08.9840829Z    Compiling atomic-waker v1.1.2
2026-07-29T09:51:08.9925340Z    Compiling const-oid v0.10.2
2026-07-29T09:51:09.0134586Z    Compiling unicode-xid v0.2.6
2026-07-29T09:51:09.0420996Z    Compiling parking_lot_core v0.9.12
2026-07-29T09:51:09.0548602Z    Compiling paste v1.0.15
2026-07-29T09:51:09.1043922Z    Compiling httparse v1.10.1
2026-07-29T09:51:09.1125768Z    Compiling num-traits v0.2.19
2026-07-29T09:51:09.1621116Z    Compiling sha2 v0.10.9
2026-07-29T09:51:09.1831183Z    Compiling hybrid-array v0.4.12
2026-07-29T09:51:09.1906068Z    Compiling base64ct v1.8.3
2026-07-29T09:51:09.2290980Z    Compiling rustix v1.1.4
2026-07-29T09:51:09.2877117Z    Compiling either v1.16.0
2026-07-29T09:51:09.3060723Z    Compiling powerfmt v0.2.0
2026-07-29T09:51:09.3820552Z    Compiling getrandom v0.2.17
2026-07-29T09:51:09.4763697Z    Compiling mio v1.2.1
2026-07-29T09:51:09.4967094Z    Compiling socket2 v0.6.4
2026-07-29T09:51:09.5422444Z    Compiling rand_core v0.6.4
2026-07-29T09:51:09.5427925Z    Compiling fs2 v0.4.3
2026-07-29T09:51:09.5941704Z    Compiling http-body v1.0.1
2026-07-29T09:51:09.7101560Z    Compiling uuid v1.23.2
2026-07-29T09:51:09.7405995Z    Compiling rand v0.10.1
2026-07-29T09:51:09.7549078Z    Compiling deranged v0.5.8
2026-07-29T09:51:09.7621185Z    Compiling pem-rfc7468 v1.0.0
2026-07-29T09:51:09.8300688Z    Compiling ref-cast v1.0.25
2026-07-29T09:51:10.0124728Z    Compiling cmake v0.1.58
2026-07-29T09:51:10.0266748Z    Compiling base64 v0.22.1
2026-07-29T09:51:10.0613469Z    Compiling tower-service v0.3.3
2026-07-29T09:51:10.1073106Z    Compiling data-encoding v2.11.0
2026-07-29T09:51:10.1220661Z    Compiling num-conv v0.2.2
2026-07-29T09:51:10.1516308Z    Compiling time-core v0.1.8
2026-07-29T09:51:10.2183211Z    Compiling linux-raw-sys v0.12.1
2026-07-29T09:51:10.2264001Z    Compiling tinyvec_macros v0.1.1
2026-07-29T09:51:10.2441131Z    Compiling try-lock v0.2.5
2026-07-29T09:51:10.3045819Z    Compiling tinyvec v1.11.0
2026-07-29T09:51:10.3440423Z    Compiling want v0.3.1
2026-07-29T09:51:10.3616648Z    Compiling parking_lot v0.12.5
2026-07-29T09:51:10.3770801Z    Compiling crypto-common v0.2.2
2026-07-29T09:51:10.3950764Z    Compiling block-buffer v0.12.0
2026-07-29T09:51:10.4671875Z    Compiling inout v0.1.4
2026-07-29T09:51:10.5090445Z    Compiling vergen-lib v9.1.0
2026-07-29T09:51:10.5617034Z    Compiling aho-corasick v1.1.4
2026-07-29T09:51:10.5650420Z    Compiling n0-future v0.3.2
2026-07-29T09:51:10.6170416Z    Compiling winnow v1.0.3
2026-07-29T09:51:10.7337474Z    Compiling winnow v0.7.15
2026-07-29T09:51:10.7342187Z    Compiling cordyceps v0.3.4
2026-07-29T09:51:10.8359195Z    Compiling httpdate v1.0.3
2026-07-29T09:51:10.8630473Z    Compiling crossbeam-utils v0.8.21
2026-07-29T09:51:10.9640867Z    Compiling spin v0.10.0
2026-07-29T09:51:11.0430732Z    Compiling aws-lc-sys v0.41.0
2026-07-29T09:51:11.0771652Z    Compiling libsqlite3-sys v0.30.1
2026-07-29T09:51:11.1287415Z    Compiling ring v0.17.14
2026-07-29T09:51:11.1395394Z    Compiling diatomic-waker v0.2.3
2026-07-29T09:51:11.2280361Z    Compiling toml_write v0.1.2
2026-07-29T09:51:11.2567028Z    Compiling parking v2.2.1
2026-07-29T09:51:11.3288147Z    Compiling regex-syntax v0.8.10
2026-07-29T09:51:11.3742683Z    Compiling futures-lite v2.6.1
2026-07-29T09:51:11.4410542Z    Compiling digest v0.11.3
2026-07-29T09:51:11.4678463Z    Compiling futures-buffered v0.2.13
2026-07-29T09:51:11.6250427Z    Compiling cipher v0.4.4
2026-07-29T09:51:11.6498621Z    Compiling netlink-packet-core v0.8.1
2026-07-29T09:51:11.8941028Z    Compiling universal-hash v0.5.1
2026-07-29T09:51:11.9073678Z    Compiling vergen v9.1.0
2026-07-29T09:51:11.9801111Z    Compiling vergen-lib v0.1.6
2026-07-29T09:51:11.9990603Z    Compiling heapless v0.7.17
2026-07-29T09:51:12.0810775Z    Compiling curve25519-dalek v5.0.0-pre.6
2026-07-29T09:51:12.1516231Z    Compiling noq-udp v0.10.0
2026-07-29T09:51:12.1651167Z    Compiling sync_wrapper v1.0.2
2026-07-29T09:51:12.2041126Z    Compiling byteorder v1.5.0
2026-07-29T09:51:12.2172277Z    Compiling toml_parser v1.1.2+spec-1.1.0
2026-07-29T09:51:12.2445467Z    Compiling dyn-clone v1.0.20
2026-07-29T09:51:12.3071255Z    Compiling allocator-api2 v0.2.21
2026-07-29T09:51:12.3491347Z    Compiling toml_datetime v1.1.1+spec-1.1.0
2026-07-29T09:51:12.3680848Z    Compiling opaque-debug v0.3.1
2026-07-29T09:51:12.4221131Z    Compiling polyval v0.6.2
2026-07-29T09:51:12.4330733Z    Compiling hash32 v0.2.1
2026-07-29T09:51:12.5850986Z    Compiling hmac v0.12.1
2026-07-29T09:51:12.6133934Z    Compiling spin v0.9.8
2026-07-29T09:51:12.6400834Z    Compiling vergen-gitcl v1.0.8
2026-07-29T09:51:12.6891079Z    Compiling ryu v1.0.23
2026-07-29T09:51:12.7068719Z    Compiling arrayvec v0.7.6
2026-07-29T09:51:12.7955895Z    Compiling toml_edit v0.25.12+spec-1.1.0
2026-07-29T09:51:12.8155352Z    Compiling tower-layer v0.3.3
2026-07-29T09:51:12.9231413Z    Compiling synstructure v0.13.2
2026-07-29T09:51:12.9301094Z    Compiling darling_core v0.20.11
2026-07-29T09:51:12.9790763Z    Compiling serde_derive_internals v0.29.1
2026-07-29T09:51:13.0150751Z    Compiling signature v3.0.0
2026-07-29T09:51:13.0620544Z    Compiling num_threads v0.1.7
2026-07-29T09:51:13.1650783Z    Compiling time v0.3.47
2026-07-29T09:51:13.2008264Z    Compiling ghash v0.5.1
2026-07-29T09:51:13.3064798Z    Compiling aes v0.8.4
2026-07-29T09:51:13.3170510Z    Compiling ctr v0.9.2
2026-07-29T09:51:13.3201161Z    Compiling sha2 v0.11.0-rc.5
2026-07-29T09:51:13.5260710Z    Compiling http-body-util v0.1.3
2026-07-29T09:51:13.6480585Z    Compiling proc-macro-crate v3.5.0
2026-07-29T09:51:13.7021700Z    Compiling aead v0.5.2
2026-07-29T09:51:13.8128632Z    Compiling openssl-probe v0.2.1
2026-07-29T09:51:13.8470117Z    Compiling regex-automata v0.4.14
2026-07-29T09:51:14.0031054Z    Compiling utf8parse v0.2.2
2026-07-29T09:51:14.0970439Z    Compiling aes-gcm v0.10.3
2026-07-29T09:51:14.1090976Z    Compiling crossbeam-epoch v0.9.18
2026-07-29T09:51:14.1130397Z    Compiling crossbeam-channel v0.5.15
2026-07-29T09:51:14.2332437Z    Compiling netlink-packet-route v0.29.0
2026-07-29T09:51:14.2660318Z    Compiling blake3 v1.8.5
2026-07-29T09:51:14.2820820Z    Compiling memoffset v0.6.5
2026-07-29T09:51:14.2970882Z    Compiling acto v0.8.2
2026-07-29T09:51:14.3177051Z    Compiling noq v0.18.0
2026-07-29T09:51:14.4402339Z    Compiling netwatch v0.16.0
2026-07-29T09:51:14.5021043Z    Compiling sorted-index-buffer v0.2.1
2026-07-29T09:51:14.5650761Z    Compiling foldhash v0.2.0
2026-07-29T09:51:14.5818248Z    Compiling rustc-hash v2.1.2
2026-07-29T09:51:14.5919981Z    Compiling identity-hash v0.1.0
2026-07-29T09:51:14.6557532Z    Compiling thiserror v1.0.69
2026-07-29T09:51:14.6790485Z    Compiling lru-slab v0.1.2
2026-07-29T09:51:14.6880671Z    Compiling xml-rs v0.8.28
2026-07-29T09:51:14.6881414Z    Compiling mac-addr v0.3.0
2026-07-29T09:51:14.7699803Z    Compiling tagptr v0.2.0
2026-07-29T09:51:14.7961250Z    Compiling hashbrown v0.16.1
2026-07-29T09:51:14.9381254Z    Compiling netlink-packet-route v0.30.0
2026-07-29T09:51:14.9651095Z    Compiling serde_derive v1.0.228
2026-07-29T09:51:15.0110772Z    Compiling zeroize_derive v1.4.3
2026-07-29T09:51:15.0220804Z    Compiling tokio-macros v2.7.0
2026-07-29T09:51:15.3762621Z    Compiling zerofrom-derive v0.1.7
2026-07-29T09:51:15.5490761Z    Compiling futures-macro v0.3.32
2026-07-29T09:51:15.6120780Z    Compiling yoke-derive v0.8.2
2026-07-29T09:51:15.6511843Z    Compiling zeroize v1.8.2
2026-07-29T09:51:15.6667435Z    Compiling curve25519-dalek-derive v0.1.1
2026-07-29T09:51:15.7281267Z    Compiling zerovec-derive v0.11.3
2026-07-29T09:51:15.7560567Z    Compiling tokio v1.52.3
2026-07-29T09:51:15.8332664Z    Compiling displaydoc v0.2.6
2026-07-29T09:51:16.2428894Z    Compiling tracing-attributes v0.1.31
2026-07-29T09:51:16.2711190Z    Compiling rustls-pki-types v1.14.1
2026-07-29T09:51:16.3465308Z    Compiling thiserror-impl v2.0.18
2026-07-29T09:51:16.5187189Z    Compiling futures-util v0.3.32
2026-07-29T09:51:16.9190977Z    Compiling zerofrom v0.1.8
2026-07-29T09:51:16.9450631Z    Compiling darling_macro v0.20.11
2026-07-29T09:51:17.0235494Z    Compiling yoke v0.8.3
2026-07-29T09:51:17.0357011Z    Compiling derive_more-impl v2.1.1
2026-07-29T09:51:17.2380769Z    Compiling zerotrie v0.2.4
2026-07-29T09:51:17.2830845Z    Compiling zerovec v0.11.6
2026-07-29T09:51:17.3209427Z    Compiling darling v0.20.11
2026-07-29T09:51:17.3978869Z    Compiling derive_builder_core v0.20.2
2026-07-29T09:51:17.5935464Z    Compiling ed25519-dalek v2.2.0
2026-07-29T09:51:17.9112454Z    Compiling spt-proto v0.45.0 (/home/reavus/actions-runner/_work/spt-bs-core/spt-bs-core/crates/spt-proto)
2026-07-29T09:51:17.9270560Z    Compiling spez v0.1.2
2026-07-29T09:51:18.0461734Z    Compiling tinystr v0.8.3
2026-07-29T09:51:18.1626057Z    Compiling potential_utf v0.1.5
2026-07-29T09:51:18.2347722Z    Compiling icu_locale_core v2.2.0
2026-07-29T09:51:18.3570692Z    Compiling icu_collections v2.2.0
2026-07-29T09:51:18.3820991Z    Compiling n0-error-macros v0.1.3
2026-07-29T09:51:18.3908150Z    Compiling der v0.8.0-rc.10
2026-07-29T09:51:18.6929987Z    Compiling derive_builder_macro v0.20.2
2026-07-29T09:51:19.0960664Z    Compiling derive_builder v0.20.2
2026-07-29T09:51:19.1070060Z    Compiling ref-cast-impl v1.0.25
2026-07-29T09:51:19.1916356Z    Compiling pin-project-internal v1.1.13
2026-07-29T09:51:19.4150730Z    Compiling icu_provider v2.2.0
2026-07-29T09:51:19.5680725Z    Compiling n0-error v0.1.3
2026-07-29T09:51:19.7719993Z    Compiling icu_normalizer v2.2.0
2026-07-29T09:51:19.8060869Z    Compiling icu_properties v2.2.0
2026-07-29T09:51:19.8101187Z    Compiling spki v0.8.0-rc.4
2026-07-29T09:51:19.9190911Z    Compiling schemars_derive v1.2.1
2026-07-29T09:51:20.0305246Z    Compiling pkcs8 v0.11.0-rc.10
2026-07-29T09:51:20.0510812Z    Compiling regex v1.12.3
2026-07-29T09:51:20.2057159Z    Compiling ipnet v2.12.0
2026-07-29T09:51:20.3449579Z    Compiling serde_spanned v0.6.9
2026-07-29T09:51:20.3809869Z    Compiling toml_datetime v0.6.11
2026-07-29T09:51:20.4758492Z    Compiling futures-executor v0.3.32
2026-07-29T09:51:20.5520673Z    Compiling ed25519 v3.0.0-rc.4
2026-07-29T09:51:20.5886514Z    Compiling pin-project v1.1.13
2026-07-29T09:51:20.6118818Z    Compiling toml_edit v0.22.27
2026-07-29T09:51:20.6650699Z    Compiling futures v0.3.32
2026-07-29T09:51:20.7350676Z    Compiling prefix-trie v0.8.4
2026-07-29T09:51:20.9896077Z    Compiling once_cell v1.21.4
2026-07-29T09:51:21.0060676Z    Compiling cobs v0.3.0
2026-07-29T09:51:21.1520190Z    Compiling postcard-derive v0.2.2
2026-07-29T09:51:21.1643096Z    Compiling tracing-core v0.1.36
2026-07-29T09:51:21.2476208Z    Compiling idna_adapter v1.2.2
2026-07-29T09:51:21.3725661Z    Compiling tokio-util v0.7.18
2026-07-29T09:51:21.4400534Z    Compiling hashbrown v0.14.5
2026-07-29T09:51:21.4590497Z    Compiling idna v1.1.0
2026-07-29T09:51:21.5265540Z    Compiling netlink-sys v0.8.8
2026-07-29T09:51:21.6821432Z    Compiling tracing v0.1.44
2026-07-29T09:51:21.7434836Z    Compiling derive_more v2.1.1
2026-07-29T09:51:21.7869301Z    Compiling data-encoding-macro-internal v0.1.18
2026-07-29T09:51:21.8650747Z    Compiling postcard v1.1.3
2026-07-29T09:51:21.9230749Z    Compiling url v2.5.8
2026-07-29T09:51:22.0500596Z    Compiling schemars v1.2.1
2026-07-29T09:51:22.1160523Z    Compiling ed25519-dalek v3.0.0-pre.6
2026-07-29T09:51:22.2474293Z    Compiling hashlink v0.9.1
2026-07-29T09:51:22.2690418Z    Compiling data-encoding-macro v0.1.20
2026-07-29T09:51:22.3372407Z    Compiling tower v0.5.3
2026-07-29T09:51:22.3411213Z    Compiling tempfile v3.27.0
2026-07-29T09:51:22.5228786Z    Compiling h2 v0.4.14
2026-07-29T09:51:22.6090785Z    Compiling rusqlite v0.32.1
2026-07-29T09:51:22.6512264Z    Compiling rustls-native-certs v0.8.4
2026-07-29T09:51:22.6621129Z    Compiling async-trait v0.1.89
2026-07-29T09:51:22.7286394Z    Compiling hickory-proto v0.26.0-beta.4
2026-07-29T09:51:23.0010624Z    Compiling strum_macros v0.28.0
2026-07-29T09:51:23.0610809Z    Compiling enum-assoc v1.3.0
2026-07-29T09:51:23.2022683Z    Compiling toml v0.8.23
2026-07-29T09:51:23.3050792Z    Compiling num_enum_derive v0.7.6
2026-07-29T09:51:23.3140648Z    Compiling iroh-metrics-derive v0.4.1
2026-07-29T09:51:23.4040123Z    Compiling iroh-relay v0.98.0
2026-07-29T09:51:23.7110571Z    Compiling tower-http v0.6.11
2026-07-29T09:51:23.8300914Z    Compiling spt-store v0.45.0 (/home/reavus/actions-runner/_work/spt-bs-core/spt-bs-core/crates/spt-store)
2026-07-29T09:51:23.8506554Z    Compiling iroh-metrics v0.38.3
2026-07-29T09:51:23.9460822Z    Compiling iroh-base v0.98.0
2026-07-29T09:51:24.2600879Z    Compiling attohttpc v0.30.1
2026-07-29T09:51:24.2996541Z    Compiling n0-watcher v0.6.1
2026-07-29T09:51:24.5130578Z    Compiling num_enum v0.7.6
2026-07-29T09:51:24.5220833Z    Compiling tokio-stream v0.1.18
2026-07-29T09:51:24.5500808Z    Compiling netlink-proto v0.12.0
2026-07-29T09:51:24.6091318Z    Compiling netdev v0.42.0
2026-07-29T09:51:24.7111001Z    Compiling moka v0.12.15
2026-07-29T09:51:24.7550579Z    Compiling xmltree v0.10.3
2026-07-29T09:51:24.7746997Z    Compiling thiserror-impl v1.0.69
2026-07-29T09:51:24.8360844Z    Compiling termios v0.2.2
2026-07-29T09:51:25.0102250Z    Compiling ioctl-rs v0.1.6
2026-07-29T09:51:25.0200674Z    Compiling serial-core v0.4.0
2026-07-29T09:51:25.1090138Z    Compiling simple-dns v0.9.3
2026-07-29T09:51:25.1422875Z    Compiling smol_str v0.1.24
2026-07-29T09:51:25.1641495Z    Compiling resolv-conf v0.7.6
2026-07-29T09:51:25.1729703Z    Compiling constant_time_eq v0.4.2
2026-07-29T09:51:25.2257428Z    Compiling sha1_smol v1.0.1
2026-07-29T09:51:25.3290693Z    Compiling simdutf8 v0.1.5
2026-07-29T09:51:25.3834111Z    Compiling arrayref v0.3.9
2026-07-29T09:51:25.6900964Z    Compiling serial-unix v0.4.0
2026-07-29T09:51:25.7502878Z    Compiling webpki-roots v1.0.7
2026-07-29T09:51:25.7800743Z    Compiling strum v0.28.0
2026-07-29T09:51:25.8638105Z    Compiling lru v0.16.4
2026-07-29T09:51:25.9642813Z    Compiling serde_bytes v0.11.19
2026-07-29T09:51:25.9689422Z    Compiling seize v0.5.1
2026-07-29T09:51:25.9800785Z    Compiling iroh v0.98.2
2026-07-29T09:51:26.0491831Z    Compiling pin-utils v0.1.0
2026-07-29T09:51:26.0975649Z    Compiling cmov v0.5.4
2026-07-29T09:51:26.1062594Z    Compiling bitflags v1.3.2
2026-07-29T09:51:26.1169223Z    Compiling swarm-discovery v0.6.0-alpha.2
2026-07-29T09:51:26.1779498Z    Compiling nix v0.25.1
2026-07-29T09:51:26.1861399Z    Compiling serial v0.4.0
2026-07-29T09:51:26.2005099Z    Compiling papaya v0.2.4
2026-07-29T09:51:26.2611851Z    Compiling backon v1.6.0
2026-07-29T09:51:26.2840680Z    Compiling hkdf v0.12.4
2026-07-29T09:51:26.3050859Z    Compiling vte_generate_state_changes v0.1.2
2026-07-29T09:51:26.3910647Z    Compiling ctutils v0.4.2
2026-07-29T09:51:26.4321113Z    Compiling filedescriptor v0.8.3
2026-07-29T09:51:26.4480813Z    Compiling shell-words v1.1.1
2026-07-29T09:51:26.4550906Z    Compiling unicode-width v0.2.0
2026-07-29T09:51:26.4736291Z    Compiling iroh-dns v0.98.0
2026-07-29T09:51:26.5770994Z    Compiling downcast-rs v1.2.1
2026-07-29T09:51:26.6006185Z    Compiling vte v0.13.1
2026-07-29T09:51:26.6450050Z    Compiling spake2 v0.4.0
2026-07-29T09:51:26.6556224Z    Compiling sha1 v0.10.6
2026-07-29T09:51:26.6623729Z    Compiling unicode-width v0.1.14
2026-07-29T09:51:26.6840513Z    Compiling doctest-file v1.1.1
2026-07-29T09:51:26.7570363Z    Compiling errno v0.3.14
2026-07-29T09:51:26.7820890Z    Compiling signal-hook v0.3.18
2026-07-29T09:51:26.9325609Z    Compiling signal-hook-registry v1.4.8
2026-07-29T09:51:26.9587008Z    Compiling darling_core v0.23.0
2026-07-29T09:51:26.9725345Z    Compiling rustix v0.38.44
2026-07-29T09:51:26.9810814Z    Compiling anstyle-parse v1.0.0
2026-07-29T09:51:26.9939313Z    Compiling anstyle-query v1.1.5
2026-07-29T09:51:27.0125328Z    Compiling linux-raw-sys v0.4.15
2026-07-29T09:51:27.0920831Z    Compiling is_terminal_polyfill v1.70.2
2026-07-29T09:51:27.1710827Z    Compiling interprocess v2.4.2
2026-07-29T09:51:27.1991599Z    Compiling anstyle v1.0.14
2026-07-29T09:51:27.3101277Z    Compiling colorchoice v1.0.5
2026-07-29T09:51:27.3881629Z    Compiling instability v0.3.12
2026-07-29T09:51:27.4130706Z    Compiling foldhash v0.1.5
2026-07-29T09:51:27.4689689Z    Compiling anstream v1.0.0
2026-07-29T09:51:27.5950953Z    Compiling hashbrown v0.15.5
2026-07-29T09:51:27.6110563Z    Compiling signal-hook-mio v0.2.5
2026-07-29T09:51:27.6271001Z    Compiling strum_macros v0.26.4
2026-07-29T09:51:27.7590587Z    Compiling terminal_size v0.4.4
2026-07-29T09:51:27.7850565Z    Compiling itertools v0.13.0
2026-07-29T09:51:27.8970743Z    Compiling spt-msg v0.45.0 (/home/reavus/actions-runner/_work/spt-bs-core/spt-bs-core/crates/spt-msg)
2026-07-29T09:51:27.9040492Z    Compiling castaway v0.2.4
2026-07-29T09:51:28.0040777Z    Compiling bytemuck v1.25.2
2026-07-29T09:51:28.0170734Z    Compiling clap_lex v1.1.0
2026-07-29T09:51:28.0390784Z    Compiling indoc v2.0.7
2026-07-29T09:51:28.2360916Z    Compiling hyper v1.10.1
2026-07-29T09:51:28.3375057Z    Compiling spt-runtime v0.45.0 (/home/reavus/actions-runner/_work/spt-bs-core/spt-bs-core/crates/spt-runtime)
2026-07-29T09:51:28.3740806Z    Compiling static_assertions v1.1.0
2026-07-29T09:51:28.4037701Z    Compiling lru v0.12.5
2026-07-29T09:51:28.4433006Z    Compiling compact_str v0.8.2
2026-07-29T09:51:28.5121065Z    Compiling rgb v0.8.53
2026-07-29T09:51:28.6030929Z    Compiling crossterm v0.28.1
2026-07-29T09:51:28.8491150Z    Compiling clap_builder v4.6.0
2026-07-29T09:51:28.8771490Z    Compiling clap_derive v4.6.1
2026-07-29T09:51:29.0490408Z    Compiling iana-time-zone v0.1.65
2026-07-29T09:51:29.3941116Z    Compiling cassowary v0.3.0
2026-07-29T09:51:29.5630528Z    Compiling chrono v0.4.45
2026-07-29T09:51:29.7800551Z    Compiling unicode-truncate v1.1.0
2026-07-29T09:51:29.9274834Z    Compiling avt v0.18.0
2026-07-29T09:51:30.1740598Z    Compiling hyper-util v0.1.20
2026-07-29T09:51:30.3145004Z    Compiling portable-pty v0.8.1
2026-07-29T09:51:30.3570578Z    Compiling strum v0.26.3
2026-07-29T09:51:30.5072393Z    Compiling spt-test-support v0.45.0 (/home/reavus/actions-runner/_work/spt-bs-core/spt-bs-core/crates/spt-test-support)
2026-07-29T09:51:30.5160633Z    Compiling nucleo-matcher v0.3.1
2026-07-29T09:51:30.5287178Z    Compiling qrcode v0.14.1
2026-07-29T09:51:30.5828800Z    Compiling darling_macro v0.23.0
2026-07-29T09:51:31.0251273Z    Compiling spt-term v0.45.0 (/home/reavus/actions-runner/_work/spt-bs-core/spt-bs-core/crates/spt-term)
2026-07-29T09:51:31.1810932Z    Compiling darling v0.23.0
2026-07-29T09:51:31.5670843Z    Compiling clap v4.6.1
2026-07-29T09:51:31.9000732Z    Compiling ratatui v0.29.0
2026-07-29T09:51:31.9731165Z    Compiling spt-live v0.45.0 (/home/reavus/actions-runner/_work/spt-bs-core/spt-bs-core/crates/spt-live)
2026-07-29T09:51:32.1146460Z    Compiling igd-next v0.17.1
2026-07-29T09:51:33.4135266Z    Compiling portmapper v0.16.0
2026-07-29T09:51:34.5268425Z    Compiling mock-adapter v0.45.0 (/home/reavus/actions-runner/_work/spt-bs-core/spt-bs-core/adapters/mock)
2026-07-29T09:51:41.2078483Z    Compiling rustls-webpki v0.103.13
2026-07-29T09:51:43.5406319Z    Compiling tokio-rustls v0.26.4
2026-07-29T09:51:43.5408647Z    Compiling noq-proto v0.17.0
2026-07-29T09:51:43.5409085Z    Compiling rustls-platform-verifier v0.7.0
2026-07-29T09:51:43.6830945Z    Compiling hickory-net v0.26.0-beta.4
2026-07-29T09:51:43.6832111Z    Compiling hyper-rustls v0.27.9
2026-07-29T09:51:43.6832545Z    Compiling tokio-websockets v0.13.2
2026-07-29T09:51:43.8097868Z    Compiling reqwest v0.13.4
2026-07-29T09:51:44.7255033Z    Compiling hickory-resolver v0.26.0-beta.4
2026-07-29T09:51:58.4255521Z    Compiling spt-net v0.45.0 (/home/reavus/actions-runner/_work/spt-bs-core/spt-bs-core/crates/spt-net)
2026-07-29T09:52:00.0035694Z    Compiling spt-daemon v0.45.0 (/home/reavus/actions-runner/_work/spt-bs-core/spt-bs-core/crates/spt-daemon)
2026-07-29T09:52:11.3587528Z    Compiling spt v0.45.0 (/home/reavus/actions-runner/_work/spt-bs-core/spt-bs-core/crates/spt)
2026-07-29T09:52:11.3588529Z    Compiling xtask v0.45.0 (/home/reavus/actions-runner/_work/spt-bs-core/spt-bs-core/crates/xtask)
2026-07-29T09:52:20.4486988Z     Finished `test` profile [unoptimized + debuginfo] target(s) in 1m 14s
2026-07-29T09:52:20.4755118Z      Running unittests src/capture_player.rs (target/debug/deps/capture_player-ac96f86427963963)
2026-07-29T09:52:20.4765452Z 
2026-07-29T09:52:20.4765550Z running 2 tests
2026-07-29T09:52:20.4771202Z test tests::parses_a_well_formed_record ... ok
2026-07-29T09:52:20.4771644Z      Running unittests src/console_mode_probe.rs (target/debug/deps/console_mode_probe-4631fcd2c9f71808)
2026-07-29T09:52:20.4772045Z test tests::refuses_a_length_mismatch ... ok
2026-07-29T09:52:20.4772216Z 
2026-07-29T09:52:20.4772422Z test result: ok. 2 passed; 0 failed; 0 ignored; 0 measured; 0 filtered out; finished in 0.00s
2026-07-29T09:52:20.4772698Z 
2026-07-29T09:52:20.4781408Z 
2026-07-29T09:52:20.4781527Z running 0 tests
2026-07-29T09:52:20.4781709Z 
2026-07-29T09:52:20.4781918Z test result: ok. 0 passed; 0 failed; 0 ignored; 0 measured; 0 filtered out; finished in 0.00s
2026-07-29T09:52:20.4782219Z 
2026-07-29T09:52:20.4783374Z      Running unittests src/main.rs (target/debug/deps/mock_session-218862da17d0d1c1)
2026-07-29T09:52:20.4792022Z 
2026-07-29T09:52:20.4792121Z running 0 tests
2026-07-29T09:52:20.4792293Z 
2026-07-29T09:52:20.4792603Z test result: ok. 0 passed; 0 failed; 0 ignored; 0 measured; 0 filtered out; finished in 0.00s
2026-07-29T09:52:20.4793022Z 
2026-07-29T09:52:20.4794067Z      Running unittests src/shell.rs (target/debug/deps/mock_shell-38ccdb0e117a09fa)
2026-07-29T09:52:20.4801721Z 
2026-07-29T09:52:20.4801908Z running 0 tests
2026-07-29T09:52:20.4802163Z 
2026-07-29T09:52:20.4802485Z test result: ok. 0 passed; 0 failed; 0 ignored; 0 measured; 0 filtered out; finished in 0.00s
2026-07-29T09:52:20.4802915Z 
2026-07-29T09:52:20.4803793Z      Running unittests tests/fixtures/gh_fixture.rs (target/debug/deps/gh_fixture-02c17df5813091d3)
2026-07-29T09:52:20.4810788Z 
2026-07-29T09:52:20.4810913Z running 0 tests
2026-07-29T09:52:20.4811190Z 
2026-07-29T09:52:20.4811576Z test result: ok. 0 passed; 0 failed; 0 ignored; 0 measured; 0 filtered out; finished in 0.00s
2026-07-29T09:52:20.4811976Z 
2026-07-29T09:52:20.4812571Z      Running unittests tests/fixtures/git_fixture.rs (target/debug/deps/git_fixture-3699941722a9ce47)
2026-07-29T09:52:20.4820348Z 
2026-07-29T09:52:20.4820535Z running 0 tests
2026-07-29T09:52:20.4870731Z      Running unittests tests/fixtures/post_step_fixture.rs (target/debug/deps/post_step_fixture-c478d99a0f69edcd)
2026-07-29T09:52:20.4871290Z      Running unittests src/main.rs (target/debug/deps/spt-c2028e83f31baa32)
2026-07-29T09:52:20.4871547Z 
2026-07-29T09:52:20.4871753Z test result: ok. 0 passed; 0 failed; 0 ignored; 0 measured; 0 filtered out; finished in 0.00s
2026-07-29T09:52:20.4872015Z 
2026-07-29T09:52:20.4872043Z 
2026-07-29T09:52:20.4872143Z running 0 tests
2026-07-29T09:52:20.4872244Z 
2026-07-29T09:52:20.4872448Z test result: ok. 0 passed; 0 failed; 0 ignored; 0 measured; 0 filtered out; finished in 0.00s
2026-07-29T09:52:20.4872740Z 
2026-07-29T09:52:20.4873034Z 
2026-07-29T09:52:20.4873120Z running 449 tests
2026-07-29T09:52:20.4875552Z test api::auth::tests::mints_distinct_nonempty_tokens ... ok
2026-07-29T09:52:20.5019036Z test api::auth::tests::dead_owner_repin_refused_when_sid_is_a_psyche_custody_sid ... ok
2026-07-29T09:52:20.5043971Z test api::auth::tests::dead_owner_repin_refused_when_sid_owns_another_perch ... ok
2026-07-29T09:52:20.5074078Z test api::auth::tests::dead_owner_repin_still_rescues_a_non_custody_sid ... ok
2026-07-29T09:52:20.5083652Z test api::auth::tests::missing_endpoint_is_no_endpoint ... ok
2026-07-29T09:52:20.5084319Z test api::auth::tests::live_owner_mismatch_still_refuses ... ok
2026-07-29T09:52:20.5090207Z test api::delivery::tests::inject_all_pty_falls_back_to_hook ... ok
2026-07-29T09:52:20.5092716Z test api::delivery::tests::inject_resolution_drops_pty_defaults_hook ... ok
2026-07-29T09:52:20.5095237Z test api::auth::tests::no_proof_is_refused ... ok
2026-07-29T09:52:20.5115050Z test api::auth::tests::pinned_to_dead_sid_mismatched_poll_repins ... ok
2026-07-29T09:52:20.5125477Z test api::auth::tests::session_id_proof_authenticates ... ok
2026-07-29T09:52:20.5134843Z test api::auth::tests::token_auth_path_unchanged ... ok
2026-07-29T09:52:20.5144532Z test api::auth::tests::worker_missing_is_no_endpoint ... ok
2026-07-29T09:52:20.5145185Z test api::auth::tests::token_proof_authenticates ... ok
2026-07-29T09:52:20.5162543Z test api::auth::tests::worker_parent_current_sid_authenticates_after_rotation ... ok
2026-07-29T09:52:20.5179142Z test api::auth::tests::worker_wrong_sid_and_token_only_refused ... ok
2026-07-29T09:52:20.5195429Z test api::auth::tests::worker_stored_sid_authenticates ... ok
2026-07-29T09:52:20.5205732Z test api::auth::tests::wrong_token_and_wrong_session_refused ... ok
2026-07-29T09:52:20.5222210Z test api::delivery::tests::an_undated_state_is_dated_by_a_non_edge_report ... ok
2026-07-29T09:52:20.5228593Z test api::delivery::tests::echo_gate_explicit_toggle ... ok
2026-07-29T09:52:20.5239621Z test api::delivery::tests::idle_busy_transitions_manage_sentinels ... ok
2026-07-29T09:52:20.5242255Z test api::reporting::tests::capability_lists_hostable_types ... ok
2026-07-29T09:52:20.5408889Z test api::delivery::tests::idle_drain_peek_returns_non_deferred_rows_only ... ok
2026-07-29T09:52:20.5419817Z test api::delivery::tests::idle_no_gate_does_not_arm_gate ... ok
2026-07-29T09:52:20.6037225Z test api::delivery::tests::only_a_real_state_edge_stamps_the_transition_instant ... ok
2026-07-29T09:52:20.6037924Z test api::reporting::tests::endpoint_info_attached_node_from_honest_stamps ... ok
2026-07-29T09:52:20.6039302Z test api::reporting::tests::endpoint_info_attached_node_self_attributes_own_node_driver ... ok
2026-07-29T09:52:20.6042279Z test api::reporting::tests::endpoint_info_json_always_carries_an_activity_word ... ok
2026-07-29T09:52:20.6260946Z test api::delivery::tests::poll_drain_holds_deferred_while_resting_and_releases_once_on_wake ... ok
2026-07-29T09:52:20.6264789Z test api::reporting::tests::env_aliases_resolved_from_manifest ... ok
2026-07-29T09:52:20.6516589Z test api::delivery::tests::poll_drain_suppresses_idle_only_which_reaches_the_relay ... ok
2026-07-29T09:52:20.6519690Z test api::reporting::tests::filedrops_are_fixed_named_files ... ok
2026-07-29T09:52:20.6798274Z test api::delivery::tests::poll_drain_validates_notify_copies_against_their_rows ... ok
2026-07-29T09:52:20.6980855Z test api::delivery::tests::poll_drains_non_deferred_by_default ... ok
2026-07-29T09:52:20.7147050Z test api::delivery::tests::poll_only_drains_when_hook_method_present ... ok
2026-07-29T09:52:20.7265835Z test api::reporting::tests::boundary_appends_to_the_session_ledger ... ok
2026-07-29T09:52:20.7541310Z test api::reporting::tests::boundary_missing_perch_refused ... ok
2026-07-29T09:52:20.7546709Z test api::reporting::tests::boundary_injects_deferred_shell_context ... ok
2026-07-29T09:52:20.7644417Z test api::reporting::tests::boundary_rebinds_keeping_anchor ... ok
2026-07-29T09:52:20.7663475Z test api::reporting::tests::boundary_refuses_rotating_onto_a_psyche_custody_sid ... ok
2026-07-29T09:52:20.7942435Z test api::reporting::tests::boundary_resurfaces_undismissed_notifs ... ok
2026-07-29T09:52:20.8000667Z test api::startup::tests::a_dead_binder_pid_proves_nothing_and_never_drops_the_stamp ... ok
2026-07-29T09:52:20.8001593Z test api::startup::tests::a_dead_relays_capability_stamp_is_not_resurrected_by_a_listener_rebind ... ok
2026-07-29T09:52:20.8080102Z test api::reporting::tests::boundary_with_a_fresh_sid_is_unaffected_by_the_squat_guard ... ok
2026-07-29T09:52:20.8087405Z test api::reporting::tests::digest_entry_validates_and_appends_to_digest_log ... ok
2026-07-29T09:52:20.8104872Z test api::reporting::tests::driven_by_reads_daemon_marker ... ok
2026-07-29T09:52:20.8124877Z test api::reporting::tests::endpoint_info_activity_word_tracks_the_idle_sentinel ... ok
2026-07-29T09:52:20.8142228Z test api::reporting::tests::endpoint_info_reports_and_refuses ... ok
2026-07-29T09:52:20.8228751Z test api::reporting::tests::erase_unregisters_regardless_of_liveness ... ok
2026-07-29T09:52:20.8237933Z test api::reporting::tests::hint_once_per_session_one_per_message ... ok
2026-07-29T09:52:20.8247424Z test api::reporting::tests::history_log_appends ... ok
2026-07-29T09:52:20.8248065Z test api::reporting::tests::presence_records_endpoint ... ok
2026-07-29T09:52:20.8409576Z test api::reporting::tests::session_end_erase_reaps_stale_worker_then_proceeds ... ok
2026-07-29T09:52:20.8534147Z test api::reporting::tests::session_end_erase_refused_with_live_children ... ok
2026-07-29T09:52:20.8582233Z test api::reporting::tests::session_end_erase_wipes_childless_perch ... ok
2026-07-29T09:52:20.8582902Z test api::startup::tests::fresh_bind_over_dead_life_needs_both_terminal_and_a_new_session ... ok
2026-07-29T09:52:20.8633914Z test api::reporting::tests::session_end_soft_preserves_state ... ok
2026-07-29T09:52:20.8693740Z test api::reporting::tests::soft_end_preserves_a_live_listeners_address ... ok
2026-07-29T09:52:20.8694430Z test api::startup::tests::listen_never_asserts_hosting_topology_and_bind_still_does ... ok
2026-07-29T09:52:20.8695074Z test api::startup::tests::listen_online_gate_refuses_capability_only_online ... ok
2026-07-29T09:52:20.8695845Z test api::startup::tests::listen_orphan_exit_line_names_self_and_parent ... ok
2026-07-29T09:52:20.8778027Z test api::reporting::tests::soft_end_still_cleans_a_dead_listeners_address ... ok
2026-07-29T09:52:20.9463727Z test api::startup::tests::a_listener_over_a_dead_pty_is_not_offlined_by_the_liveness_reconcile ... ok
2026-07-29T09:52:20.9636647Z test api::startup::tests::bind_assigns_home_and_revive_preserves_it ... ok
2026-07-29T09:52:20.9643822Z test api::startup::tests::parent_watchdog_triggers_exit_on_a_dead_parent_only ... ok
2026-07-29T09:52:20.9731674Z test api::startup::tests::bind_gateway_earns_no_online_stamp ... ok
2026-07-29T09:52:21.2178425Z test api::startup::tests::bind_listen_control_detach_keeps_the_earned_hosting_authority ... ok
2026-07-29T09:52:21.2179419Z test api::startup::tests::read_env_measured_capture_replaces_prior_stamp ... ok
2026-07-29T09:52:21.2282664Z test api::startup::tests::bind_live_agent_over_prior_ready_agent_earns_online_on_controllable_with_preserved_type ... ok
2026-07-29T09:52:21.2481144Z test api::startup::tests::bind_records_cwd_so_picker_can_group_by_project ... ok
2026-07-29T09:52:21.2488008Z test api::startup::tests::bind_refuses_a_session_id_that_squats_a_psyche_custody_sid ... ok
2026-07-29T09:52:21.2597517Z test api::startup::tests::bind_with_type_establishes_a_gateway_endpoint ... ok
2026-07-29T09:52:21.2598002Z test api::startup::tests::seed_fail_eof_gives_actionable_stale_broker_hint ... ok
2026-07-29T09:52:21.2598810Z test api::startup::tests::seed_restorable_spends_dead_seeds_restores_recoverable ... ok
2026-07-29T09:52:21.2616042Z test api::startup::tests::bind_with_unrelated_sid_is_unaffected_by_the_squat_guard ... ok
2026-07-29T09:52:21.2673485Z test api::startup::tests::empty_session_seed_refusal_spends_the_seed_no_restore ... ok
2026-07-29T09:52:21.2733879Z test api::startup::tests::empty_session_seed_refused ... ok
2026-07-29T09:52:21.2923904Z test api::startup::tests::establish_stamps_controllable_by_hosting_mode ... ok
2026-07-29T09:52:21.3086399Z test api::startup::tests::fresh_create_over_a_stopped_life_reads_active_with_no_wake ... ok
2026-07-29T09:52:21.3236407Z test api::startup::tests::fresh_create_with_no_prior_carries_no_rest_state ... ok
2026-07-29T09:52:21.3236946Z test api::startup::tests::the_pid_role_is_stamped_from_the_entry_path ... ok
2026-07-29T09:52:21.3311405Z test api::startup::tests::live_perch_under_other_session_conflicts ... ok
2026-07-29T09:52:21.3322442Z test api::tests::adapter_is_optional ... ok
2026-07-29T09:52:21.3366873Z test api::startup::tests::missing_seed_refused ... ok
2026-07-29T09:52:21.3437617Z test api::startup::tests::no_seed_is_the_fallback_trigger_then_sid_binds ... ok
2026-07-29T09:52:21.3548135Z test api::startup::tests::post_spawn_bind_establishes_perch ... ok
2026-07-29T09:52:21.3625507Z test api::startup::tests::prebind_refusal_restores_the_seed_for_retry ... ok
2026-07-29T09:52:21.3633581Z test api::tests::state_value_is_validated ... ok
2026-07-29T09:52:21.3680125Z test api::tests::surface_parses ... ok
2026-07-29T09:52:21.3737995Z test api::startup::tests::rebind_same_session_ok ... ok
2026-07-29T09:52:21.3908069Z test api::startup::tests::revive_preserves_prior_rest_state_and_dormant_anchor ... ok
2026-07-29T09:52:21.4071012Z test api::startup::tests::revive_without_cwd_preserves_prior_cwd ... ok
2026-07-29T09:52:21.4139504Z test api::startup::tests::seed_bind_records_seed_captured_cwd ... ok
2026-07-29T09:52:21.4152131Z test api::startup::tests::session_id_fallback_binds_live_perch_from_sid ... ok
2026-07-29T09:52:21.4161002Z test api::startup::tests::session_id_fallback_refuses_empty_sid_and_dead_anchor ... ok
2026-07-29T09:52:21.4162805Z test api::startup::tests::session_id_fallback_refuses_a_psyche_custody_sid ... ok
2026-07-29T09:52:21.4169649Z test cli::resume_resolution_tests::resume_never_feeds_a_provisional ... ok
2026-07-29T09:52:21.4170070Z test cli::run_home_tests::order_by_mru_orders_guidance ... ok
2026-07-29T09:52:21.4170908Z test cli::run_home_tests::run_home_resolution_matrix ... ok
2026-07-29T09:52:21.4171923Z test cli::run_on_live_tests::run_on_live_never_duplicates_and_create_conflicts ... ok
2026-07-29T09:52:21.4172613Z test cli::run_target_tests::resolve_run_target_quadrants ... ok
2026-07-29T09:52:21.4218148Z test cli::tests::a_local_hit_never_asks_the_broker ... ok
2026-07-29T09:52:21.4218698Z test cli::tests::a_status_row_reads_held_over_running_and_carries_its_evidence ... ok
2026-07-29T09:52:21.4223542Z test api::startup::tests::stale_seed_refusal_spends_the_seed_no_restore ... ok
2026-07-29T09:52:21.4256004Z test cli::tests::adapter_add_transport_flags_parse ... ok
2026-07-29T09:52:21.4265954Z test cli::tests::access_subcommands_parse ... ok
2026-07-29T09:52:21.4279634Z test api::startup::tests::stale_seed_with_dead_anchor_refused ... ok
2026-07-29T09:52:21.4355564Z test api::startup::tests::successful_bind_consumes_the_seed_exactly_once ... ok
2026-07-29T09:52:21.4425475Z test api::startup::tests::valid_seed_binds_live_perch ... ok
2026-07-29T09:52:21.4426037Z test cli::tests::adapter_name_validation_flags_every_unknown ... ok
2026-07-29T09:52:21.4426861Z test cli::tests::adapter_names_comma_list_parses_and_refuses_empties ... ok
2026-07-29T09:52:21.4430757Z test api::tests::ctx_manifest_override_wins_when_manifest_present ... ok
2026-07-29T09:52:21.4442762Z test api::tests::ctx_manifest_unregistered_no_manifest_is_none_not_fatal ... ok
2026-07-29T09:52:21.4443500Z test api::tests::ctx_manifest_resolves_from_registry_when_manifest_absent ... ok
2026-07-29T09:52:21.4445681Z test cli::tests::adapter_translate_proof_gates_on_commit ... FAILED
2026-07-29T09:52:21.4453003Z test api::tests::load_manifest_resolves_composite_adapter_option ... ok
2026-07-29T09:52:21.4453824Z test cli::tests::adapter_update_install_dir_is_registered_source_dir_not_repo_name ... ok
2026-07-29T09:52:21.4456672Z test cli::tests::adapter_update_notice_absent_when_no_message ... ok
2026-07-29T09:52:21.4459494Z test cli::tests::adapter_update_notice_renders_declared_message_markdown ... ok
2026-07-29T09:52:21.4460212Z test cli::tests::adapter_update_summary_and_exit_aggregate_isolated_failures ... ok
2026-07-29T09:52:21.4474438Z test cli::tests::adapter_translate_proof_parses ... ok
2026-07-29T09:52:21.4481923Z test api::worker::tests::cascade_guard_tracks_live_children ... ok
2026-07-29T09:52:21.4486846Z test cli::tests::adapter_version_parses ... ok
2026-07-29T09:52:21.4487717Z test cli::tests::all_hidden_this_node_suppresses_no_perches_marker ... ok
2026-07-29T09:52:21.4488377Z test cli::tests::already_applied_message_reads_up_to_date_no_restart ... ok
2026-07-29T09:52:21.4489131Z test cli::tests::any_single_evidence_source_is_enough_and_only_nothing_refuses ... ok
2026-07-29T09:52:21.4508395Z test cli::tests::api_adapter_flag_is_group_level_not_post_subcommand ... ok
2026-07-29T09:52:21.4521626Z test api::worker::tests::guard_clears_only_when_all_children_stopped ... ok
2026-07-29T09:52:21.4522385Z test cli::tests::adapter_subcommands_parse ... ok
2026-07-29T09:52:21.4522851Z test cli::tests::applied_message_appends_restart_required_notice ... ok
2026-07-29T09:52:21.4523463Z test cli::tests::applied_message_renders_semver_or_counter_fallback_and_states_applied ... ok
2026-07-29T09:52:21.4526447Z test cli::tests::api_listen_accepts_session_id_flag ... ok
2026-07-29T09:52:21.4540489Z test cli::tests::bare_spt_parses_to_none ... ok
2026-07-29T09:52:21.4541000Z test cli::tests::bare_tty_guard ... ok
2026-07-29T09:52:21.4570853Z test cli::tests::bare_update_parses_composite_flags ... ok
2026-07-29T09:52:21.4571751Z test cli::tests::broker_image_line_reports_without_warning_or_remedy ... ok
2026-07-29T09:52:21.4572460Z test cli::tests::classify_fetch_reject_matrix ... ok
2026-07-29T09:52:21.4573089Z test cli::tests::classify_flat_archive_never_misfires ... ok
2026-07-29T09:52:21.4573730Z test cli::tests::classify_multiplatform_captures_only_known_triples ... ok
2026-07-29T09:52:21.4574309Z test cli::tests::cli_send_stamps_cli_at_node_origin ... ok
2026-07-29T09:52:21.4574785Z test cli::tests::composite_plans_core_first_and_core_only_skips_adapters ... ok
2026-07-29T09:52:21.4575309Z test cli::tests::connection_lines_net_less_hides_stale_heartbeat ... ok
2026-07-29T09:52:21.4575883Z test cli::tests::coordinator_image_line_is_the_only_stale_warning ... ok
2026-07-29T09:52:21.4577947Z test cli::tests::create_existing_name_is_usage_error ... ok
2026-07-29T09:52:21.4579950Z test cli::tests::create_new_existing_name_is_usage_error ... ok
2026-07-29T09:52:21.4675640Z test cli::tests::create_new_mints_shows_and_requests_save ... ok
2026-07-29T09:52:21.4677834Z test cli::tests::create_not_elevated_refuses_without_saving ... ok
2026-07-29T09:52:21.4780264Z test cli::tests::create_prints_joining_material_when_elevated ... ok
2026-07-29T09:52:21.4780879Z test cli::tests::cross_node_after_filters_a_sealed_turn_exactly_like_the_local_path ... ok
2026-07-29T09:52:21.4781416Z test cli::tests::daemon_offline_hint_only_when_down ... ok
2026-07-29T09:52:21.4793347Z test api::worker::tests::worker_poll_drains_spool ... ok
2026-07-29T09:52:21.4794773Z test cli::tests::daemon_refresh_verb_parses ... ok
2026-07-29T09:52:21.4795442Z test cli::tests::daemonless_apply_message_points_at_finish_or_start ... ok
2026-07-29T09:52:21.4795938Z test cli::tests::deferred_elevation_gate_matrix ... ok
2026-07-29T09:52:21.4808277Z test cli::tests::digest_cursor_flags_parse ... ok
2026-07-29T09:52:21.4818231Z test cli::tests::digest_flag_defaults ... ok
2026-07-29T09:52:21.4819204Z test cli::tests::digest_human_path_keeps_the_stderr_trailer ... ok
2026-07-29T09:52:21.4821195Z test cli::tests::digest_json_carries_version_and_leaves_stderr_clean ... ok
2026-07-29T09:52:21.4822360Z test cli::tests::digest_json_predates_path_still_carries_version ... ok
2026-07-29T09:52:21.4822932Z test cli::tests::empty_store_no_flag_guides_to_pair_or_create ... ok
2026-07-29T09:52:21.4851209Z test cli::tests::daemon_subcommands_parse ... ok
2026-07-29T09:52:21.4875300Z test cli::tests::endpoint_role_parses ... ok
2026-07-29T09:52:21.4875809Z test cli::tests::endpoint_row_json_endpoint_type_is_additive ... ok
2026-07-29T09:52:21.4966340Z test cli::tests::apply_release_crc_swap_only_swaps_changed ... ok
2026-07-29T09:52:21.4978880Z test api::worker::tests::worker_poll_holds_deferred_while_resting ... ok
2026-07-29T09:52:21.4979578Z test cli::tests::escalation_choice_parses_fail_closed ... ok
2026-07-29T09:52:21.5016702Z test api::worker::tests::worker_start_mints_id_stores_parent_sid_and_metadata ... ok
2026-07-29T09:52:21.5040625Z test api::worker::tests::worker_start_nests_under_parent ... ok
2026-07-29T09:52:21.5063691Z test cli::tests::every_read_status_command_emits_valid_json ... ok
2026-07-29T09:52:21.5064386Z test cli::tests::endpoint_subcommands_parse ... ok
2026-07-29T09:52:21.5065211Z test cli::tests::fetch_reject_action_apply_decision ... ok
2026-07-29T09:52:21.5066008Z test cli::tests::filter_after_excludes_at_or_below_cursor ... ok
2026-07-29T09:52:21.5067228Z test cli::tests::filter_after_predates_window_returns_full ... ok
2026-07-29T09:52:21.5068050Z test cli::tests::finish_message_states_fully_live_no_manual_restart ... ok
2026-07-29T09:52:21.5073555Z test api::worker::tests::worker_start_registration_sid_falls_back_to_presented ... ok
2026-07-29T09:52:21.5074371Z test cli::tests::gh_download_command_no_tag_omits_tag ... ok
2026-07-29T09:52:21.5075160Z test cli::tests::gh_download_command_with_tag_shape ... ok
2026-07-29T09:52:21.5075900Z test cli::tests::gh_failure_classes_render_os_correct_hints ... ok
2026-07-29T09:52:21.5076362Z test cli::tests::gh_release_version_compare_decision ... ok
2026-07-29T09:52:21.5076672Z test cli::tests::gh_version_command_shape ... ok
2026-07-29T09:52:21.5115518Z test cli::tests::grant_subcommands_parse ... ok
2026-07-29T09:52:21.5159162Z test cli::tests::help_groups_cover_every_command ... ok
2026-07-29T09:52:21.5245462Z test cli::tests::hot_path_flat_and_moved_verbs_gone ... ok
2026-07-29T09:52:21.5245884Z test cli::tests::extract_legacy_flat_stays_flat ... ok
2026-07-29T09:52:21.5251543Z test cli::tests::install_place_is_idempotent_and_path_block_detected ... ok
2026-07-29T09:52:21.5252128Z test cli::tests::install_platform_check_gates_stamp_and_host_arch ... ok
2026-07-29T09:52:21.5253411Z test cli::tests::instance_rows_palette_and_align ... ok
2026-07-29T09:52:21.5254683Z test cli::tests::instance_rows_project_column ... ok
2026-07-29T09:52:21.5268745Z test cli::tests::extract_multiplatform_missing_my_triple_is_typed_rejection ... ok
2026-07-29T09:52:21.5269707Z test cli::tests::join_gate_refuses_without_confirmed_elevation ... ok
2026-07-29T09:52:21.5271382Z test cli::tests::json_activity_key_is_local_only_and_skips_when_unknown ... ok
2026-07-29T09:52:21.5273468Z test cli::tests::invalid_usage_errors ... ok
2026-07-29T09:52:21.5273845Z test cli::tests::json_activity_words_come_from_the_shared_vocabulary_source ... ok
2026-07-29T09:52:21.5274937Z test cli::tests::how_to_topics_cover_ready_and_send ... ok
2026-07-29T09:52:21.5275569Z test cli::tests::json_project_field_skip_if_none ... ok
2026-07-29T09:52:21.5276920Z test cli::tests::node_group_discards_self_and_skips_empty ... ok
2026-07-29T09:52:21.5277800Z test cli::tests::node_group_freshest_epoch_wins_and_unions_subnets ... ok
2026-07-29T09:52:21.5278718Z test cli::tests::node_group_same_id_two_nodes_two_groups ... ok
2026-07-29T09:52:21.5280001Z test cli::tests::node_grouped_render_structure_and_palette ... ok
2026-07-29T09:52:21.5281129Z test cli::tests::node_level_label_names_an_endpointless_peer ... ok
2026-07-29T09:52:21.5281905Z test cli::tests::node_rows_disambiguate_only_on_label_collision ... ok
2026-07-29T09:52:21.5283262Z test cli::tests::node_status_rows_denominator_counts_routable_only ... ok
2026-07-29T09:52:21.5284410Z test cli::tests::node_status_rows_settle_cheap_signals_probe_only_stale ... ok
2026-07-29T09:52:21.5287180Z test cli::tests::not_elevated_refuses_without_leaking_code_or_saving ... ok
2026-07-29T09:52:21.5290122Z test cli::tests::notify_subnet_resolution_home_default ... ok
2026-07-29T09:52:21.5291375Z test cli::tests::extract_multiplatform_places_shared_root_and_flattens_my_triple ... ok
2026-07-29T09:52:21.5292160Z test cli::tests::origin_asset_urls_latest_and_tag ... ok
2026-07-29T09:52:21.5337097Z test cli::tests::notify_surface_parses ... ok
2026-07-29T09:52:21.5353089Z test cli::tests::pair_namespace_is_gone ... ok
2026-07-29T09:52:21.5354499Z test cli::tests::peer_health_line_names_the_stage_and_stays_silent_when_idle ... ok
2026-07-29T09:52:21.5355074Z test cli::tests::poll_until_ready_fastpath_timeout_and_later_success ... ok
2026-07-29T09:52:21.5355568Z test cli::tests::post_step_notice_arbitration ... ok
2026-07-29T09:52:21.5372860Z test cli::tests::multi_subnet_refuses_without_flag_then_resolves_with_it ... ok
2026-07-29T09:52:21.5497102Z test cli::tests::adapter_digest_proof_fills_session_id_key ... ok
2026-07-29T09:52:21.5930299Z test cli::tests::adapter_digest_proof_gates_on_drops ... ok
2026-07-29T09:52:21.5931025Z test cli::tests::project_index_line_states_health_not_presence ... ok
2026-07-29T09:52:21.5931572Z test cli::tests::prune_candidates_resolve_never_guess ... ok
2026-07-29T09:52:21.5961932Z test cli::tests::adapter_has_live_endpoint_detects_matching_live_perch ... ok
2026-07-29T09:52:21.5992846Z test cli::tests::adapter_has_live_endpoint_false_for_other_or_dead ... ok
2026-07-29T09:52:21.6020105Z test cli::tests::adapter_profile_verbs_local_only ... ok
2026-07-29T09:52:21.6034191Z test cli::tests::registered_github_home_detects_active_collision ... ok
2026-07-29T09:52:21.6049453Z test cli::tests::adapter_string_verbs ... ok
2026-07-29T09:52:21.6050364Z test cli::tests::remote_cell_project_ref_from_gossiped_recent_projects ... ok
2026-07-29T09:52:21.6060551Z test cli::tests::adapter_use_sets_and_clears_pointer ... ok
2026-07-29T09:52:21.6060977Z test cli::tests::resolve_transport_auto_follows_probe ... ok
2026-07-29T09:52:21.6061606Z test cli::tests::resolve_transport_explicit_never_probes ... ok
2026-07-29T09:52:21.6062290Z test cli::tests::rest_filter_hides_suspended_shows_all_and_corrupt_always ... ok
2026-07-29T09:52:21.6062823Z test cli::tests::rest_filter_status_first_ordering ... ok
2026-07-29T09:52:21.6063757Z test cli::tests::rest_filter_total_disclosure_and_corrupt_annotation ... ok
2026-07-29T09:52:21.6064238Z test cli::tests::restart_plans_lethal_leg_last ... ok
2026-07-29T09:52:21.6068279Z test cli::tests::adapter_version_surfaces_declared_adapter_version ... ok
2026-07-29T09:52:21.6078437Z test cli::tests::ring_timeout_defaults ... ok
2026-07-29T09:52:21.6079324Z test cli::tests::self_pin_annotates_psyche_host_failure ... ok
2026-07-29T09:52:21.6080239Z test cli::tests::self_pin_annotates_translation_fault ... ok
2026-07-29T09:52:21.6081600Z test cli::tests::self_pin_includes_description_when_present ... ok
2026-07-29T09:52:21.6087897Z test cli::tests::apply_user_msg_gate_local_origination ... ok
2026-07-29T09:52:21.6103208Z test cli::tests::send_user_msg_flag_parses ... ok
2026-07-29T09:52:21.6104162Z test cli::tests::send_reply_to_flag_is_removed_and_target_required ... ok
2026-07-29T09:52:21.6456052Z test cli::tests::release_archive_extracts_to_a_registrable_root ... ok
2026-07-29T09:52:21.6571563Z test cli::tests::run_bounded_yields_value_or_timeout_default ... ok
2026-07-29T09:52:21.7002472Z test cli::tests::probe_all_timeout_settles_false_without_stalling_batch ... ok
2026-07-29T09:52:21.7380790Z test cli::tests::probe_all_runs_concurrently_in_input_order ... ok
2026-07-29T09:52:21.7872425Z test cli::tests::endpoint_role_overwrite_is_the_sole_writer ... ok
2026-07-29T09:52:21.7959858Z test cli::tests::endpoint_stop_marks_offline ... ok
2026-07-29T09:52:21.8038397Z test cli::tests::shell_subcommands_parse ... ok
2026-07-29T09:52:21.8138335Z test cli::tests::show_code_prints_reprovisioning_material ... ok
2026-07-29T09:52:22.0375626Z test cli::tests::probe_all_cap_batches_into_windows ... ok
2026-07-29T09:52:22.2515579Z test cli::tests::json_payload_rides_as_attr_alongside_body ... ok
2026-07-29T09:52:22.2537099Z test cli::tests::fork_forks_homes_and_deletes_exactly_the_source ... ok
2026-07-29T09:52:22.2640817Z test cli::tests::single_subnet_auto_selects_and_code_matches_seed ... ok
2026-07-29T09:52:37.3543593Z test cli::tests::owner_shutdown_gated_by_can_shutdown_grant ... ok
2026-07-29T09:52:37.3755663Z test cli::tests::stage_then_swap_failed_fetch_preserves_install ... ok
2026-07-29T09:52:37.4145183Z test cli::tests::purge_force_asks_before_it_tears_anything_down ... ok
2026-07-29T09:52:37.4155905Z test cli::tests::purge_offline_gate_and_self_guard ... ok
2026-07-29T09:52:37.4156558Z test cli::tests::stall_evict_line_surfaces_only_a_real_tally ... ok
2026-07-29T09:52:37.4157526Z test cli::tests::stop_guard_refuses_live_sessions_without_force ... ok
2026-07-29T09:52:37.4170100Z test cli::tests::staged_floor_admits_when_core_meets_floor ... ok
2026-07-29T09:52:37.4242731Z test cli::tests::subcommands_parse ... ok
2026-07-29T09:52:37.4247164Z test cli::tests::subnet_status_renders_rows_and_hints_never_secrets ... ok
2026-07-29T09:52:37.4247957Z test cli::tests::subnets_joined_banner_renders_rows_and_divider ... ok
2026-07-29T09:52:37.4248637Z test cli::tests::subprocess_detail_prefers_stderr_then_stdout ... ok
2026-07-29T09:52:37.4294008Z test cli::tests::subnet_arg_shapes_parse ... ok
2026-07-29T09:52:37.4295056Z test cli::tests::this_node_group_merges_roster_with_unbound_truth ... ok
2026-07-29T09:52:37.4295854Z test cli::tests::trust_mutation_gate_refuses_without_confirmed_elevation ... ok
2026-07-29T09:52:37.4298283Z test cli::tests::unknown_elevation_falls_back ... ok
2026-07-29T09:52:37.4300439Z test cli::tests::unknown_named_subnet_is_usage_error ... ok
2026-07-29T09:52:37.4317494Z test cli::tests::update_adapters_verb_parses_with_optional_names ... ok
2026-07-29T09:52:37.4333014Z test cli::tests::update_fetch_apply_flag_parses ... ok
2026-07-29T09:52:37.4336921Z test cli::tests::the_evidence_census_reads_each_local_source ... ok
2026-07-29T09:52:37.4337653Z test elevation::tests::already_elevated_short_circuits_on_every_os ... ok
2026-07-29T09:52:37.4338496Z test elevation::tests::current_returns_a_determinate_level_on_supported_platforms ... ok
2026-07-29T09:52:37.4339497Z test elevation::tests::fallback_message_names_authenticator_app_and_subnet ... ok
2026-07-29T09:52:37.4340268Z test elevation::tests::gate_shows_only_when_confirmed_elevated ... ok
2026-07-29T09:52:37.4340885Z test elevation::tests::launcher_argv_is_absolute_exe_plus_verbatim_args ... ok
2026-07-29T09:52:37.4341405Z test elevation::tests::launchers_never_shell_interpolate_a_crafted_arg ... ok
2026-07-29T09:52:37.4341882Z test elevation::tests::print_hint_floor_uses_absolute_path_each_os ... ok
2026-07-29T09:52:37.4342392Z test elevation::tests::unix_path_order_tty_then_pkexec_then_terminal_then_hint ... ok
2026-07-29T09:52:37.4342904Z test elevation::tests::windows_uac_only_interactive_other_always_prints ... ok
2026-07-29T09:52:37.4343445Z test helpfmt::tests::atx_header_at_line_start_strips_and_bolds ... ok
2026-07-29T09:52:37.4343845Z test helpfmt::tests::bold_styles_with_color_and_strips_without ... ok
2026-07-29T09:52:37.4344966Z test helpfmt::tests::code_styles_with_color_and_strips_without ... ok
2026-07-29T09:52:37.4345441Z test helpfmt::tests::color_enabled_truth_table ... ok
2026-07-29T09:52:37.4345884Z test helpfmt::tests::dual_contract_token_survives_strip_mode ... ok
2026-07-29T09:52:37.4346631Z test cli::tests::whoami_parses_as_the_identity_verb ... ok
2026-07-29T09:52:37.4347119Z test helpfmt::tests::dual_contract_token_unstyled_while_prose_styles_on_color ... ok
2026-07-29T09:52:37.4347676Z test helpfmt::tests::empty_and_unmatched_markers_stay_literal ... ok
2026-07-29T09:52:37.4348111Z test helpfmt::tests::link_becomes_its_text ... ok
2026-07-29T09:52:37.4348517Z test helpfmt::tests::marker_never_spans_a_hard_break ... ok
2026-07-29T09:52:37.4348865Z test helpfmt::tests::marker_spans_a_clap_soft_wrap ... ok
2026-07-29T09:52:37.4349594Z test helpfmt::tests::multibyte_text_survives ... ok
2026-07-29T09:52:37.4350019Z test helpfmt::tests::nested_code_inside_bold_styles_both ... ok
2026-07-29T09:52:37.4350382Z test helpfmt::tests::plain_text_is_unchanged ... ok
2026-07-29T09:52:37.4350961Z test helpfmt::tests::preexisting_ansi_is_passed_through_untouched ... ok
2026-07-29T09:52:37.4351426Z test helpfmt::tests::resolve_console_color_strips_when_vt_unavailable ... ok
2026-07-29T09:52:37.4351845Z test picker::data::tests::disambiguate_project_ids_cases ... ok
2026-07-29T09:52:37.4352238Z test picker::data::tests::driven_by_display_renders_name_not_hex ... ok
2026-07-29T09:52:37.4560763Z test cli::tests::staged_floor_refuses_above_floor_and_leaves_dest_untouched ... ok
2026-07-29T09:52:37.7702066Z test cli::tests::resolve_proof_target_override_reads_on_disk ... ok
2026-07-29T09:52:37.7702614Z test picker::data::tests::indexed_projection_full_w2shaped_and_absent_legs ... ok
2026-07-29T09:52:37.7703350Z test picker::data::tests::non_drivable_predicate_covers_worker_and_psyche ... ok
2026-07-29T09:52:37.7711331Z test cli::tests::purge_removes_every_record ... ok
2026-07-29T09:52:37.8186566Z test cli::tests::shell_channels_relay_sensory_and_text_file ... ok
2026-07-29T09:52:37.8187796Z test picker::data::tests::project_refs_from_sessions_excludes_owlery_and_dedups_newest_first ... ok
2026-07-29T09:52:37.8189169Z test picker::data::tests::project_refs_from_unions_fresh_origin_and_store_branches ... ok
2026-07-29T09:52:37.8190223Z test picker::data::tests::reconcile_overrides_subnet_with_local_roster ... ok
2026-07-29T09:52:37.8231423Z test cli::tests::shell_owner_exclusivity_negatives ... ok
2026-07-29T09:52:37.8357239Z test cli::tests::shell_relink_relaunches_offline_instances_only ... ok
2026-07-29T09:52:37.8358235Z test picker::data::tests::resume_rows_derive_per_row_project_and_drop_owlery_sessions ... ok
2026-07-29T09:52:37.8620994Z test cli::tests::shell_spawn_approval_floor_gates ... ok
2026-07-29T09:52:37.8621852Z test picker::data::tests::row_status_drives_unbound_display ... ok
2026-07-29T09:52:37.8719566Z test cli::tests::shell_spawn_cap_and_over_cap_gates ... ok
2026-07-29T09:52:37.8720030Z test picker::model::tests::adapter_tree_nests_profiles ... ok
2026-07-29T09:52:37.8720440Z test picker::model::tests::back_unwinds ... ok
2026-07-29T09:52:37.8721160Z test picker::model::tests::build_project_choices_head_here_rest ... ok
2026-07-29T09:52:37.8721670Z test picker::model::tests::category_labels_render_display_forms ... ok
2026-07-29T09:52:37.8722196Z test picker::model::tests::category_ring_wraps ... ok
2026-07-29T09:52:37.8723007Z test picker::model::tests::change_adapter_picks_and_returns_to_confirm ... ok
2026-07-29T09:52:37.8723655Z test picker::model::tests::choose_project_outcome_bakes_cwd_and_diverts ... ok
2026-07-29T09:52:37.8724356Z test picker::model::tests::confirm_local_offline_unchanged_by_wake_split ... ok
2026-07-29T09:52:37.8725000Z test picker::model::tests::confirm_options_remote_suspended_is_wake_not_start ... ok
2026-07-29T09:52:37.8725595Z test picker::model::tests::confirm_options_status_dependent ... ok
2026-07-29T09:52:37.8726087Z test picker::model::tests::confirm_terminal_routes ... ok
2026-07-29T09:52:37.8726577Z test picker::model::tests::confirm_terminal_wake_carries_raw_node ... ok
2026-07-29T09:52:37.8727154Z test picker::model::tests::create_new_multisubnet_inserts_home_layer ... ok
2026-07-29T09:52:37.8727598Z test picker::model::tests::create_outcome_bakes_run ... ok
2026-07-29T09:52:37.8728044Z test picker::model::tests::cursor_clamps ... ok
2026-07-29T09:52:37.8728586Z test picker::model::tests::display_mapping_matrix ... ok
2026-07-29T09:52:37.8729158Z test picker::model::tests::display_status_four_state_type_gated ... ok
2026-07-29T09:52:37.8729988Z test picker::model::tests::display_status_unbound_is_hollow_and_attachable ... ok
2026-07-29T09:52:37.8730566Z test picker::model::tests::empty_scope_opens_create ... ok
2026-07-29T09:52:37.8731076Z test picker::model::tests::ep_display_glyph_and_square_palette ... ok
2026-07-29T09:52:37.8731840Z test picker::model::tests::esc_backs_out_of_home_layer ... ok
2026-07-29T09:52:37.8733397Z test picker::model::tests::filter_narrows ... ok
2026-07-29T09:52:37.8733943Z test picker::model::tests::from_resource_row_maps_gossiped_adapter_projects_controlled ... ok
2026-07-29T09:52:37.8734759Z test picker::model::tests::home_selection_bakes_into_run_subnet ... ok
2026-07-29T09:52:37.8735212Z test picker::model::tests::kind_routes ... ok
2026-07-29T09:52:37.8735732Z test picker::model::tests::launch_keys_live_only_on_launch_capable_highlights ... ok
2026-07-29T09:52:37.8736289Z test picker::model::tests::prefill_jumps_to_create ... ok
2026-07-29T09:52:37.8736914Z test picker::model::tests::project_filter_keys_on_slug_while_tab_renders_display ... ok
2026-07-29T09:52:37.8737494Z test picker::model::tests::purge_confirm_yields_outcome_and_backs_out ... ok
2026-07-29T09:52:37.8737906Z test picker::model::tests::purge_shortcut_gates_to_offline_local ... ok
2026-07-29T09:52:37.8738353Z test picker::model::tests::reenter_create_keeps_or_clears_id ... ok
2026-07-29T09:52:37.8738899Z test picker::model::tests::remove_endpoint_drops_row_and_clamps_cursor ... ok
2026-07-29T09:52:37.8739585Z test picker::model::tests::resume_outcome_adapter_follows_recorded_row ... ok
2026-07-29T09:52:37.8740134Z test picker::model::tests::resume_outcome_bakes_session ... ok
2026-07-29T09:52:37.8740905Z test picker::model::tests::resume_title_render ... ok
2026-07-29T09:52:37.8741472Z test picker::model::tests::should_offer_project_choice_fire_conditions ... ok
2026-07-29T09:52:37.8741998Z test picker::model::tests::single_subnet_skips_home_layer ... ok
2026-07-29T09:52:37.8742524Z test picker::model::tests::suspended_is_distinct_from_offline ... ok
2026-07-29T09:52:37.8743035Z test picker::model::tests::visible_partitions_and_sorts ... ok
2026-07-29T09:52:37.8743981Z test picker::shortcut::tests::bakes_create_attach_by_default ... ok
2026-07-29T09:52:37.8744638Z test picker::shortcut::tests::bakes_resume_and_action ... ok
2026-07-29T09:52:37.8745447Z test picker::shortcut::tests::basename_is_parameterized ... ok
2026-07-29T09:52:37.8746068Z test picker::shortcut::tests::sentinel_detection ... ok
2026-07-29T09:52:37.8750216Z test picker::shortcut::tests::write_create_update_refuse ... ok
2026-07-29T09:52:37.8750737Z test picker::tests::backspace_backs_out_screens_like_esc ... ok
2026-07-29T09:52:37.8751409Z test picker::tests::backspace_stays_char_delete_in_text_contexts ... ok
2026-07-29T09:52:37.8751932Z test picker::tests::purge_outcomes_convert_to_flash_lines ... ok
2026-07-29T09:52:37.8815383Z test picker::tests::purge_transition_reconstructs_the_complete_screen_after_external_mutation ... ok
2026-07-29T09:52:37.8854296Z test picker::view::tests::adapter_tree_buffer ... ok
2026-07-29T09:52:37.8878582Z test picker::view::tests::change_adapter_screen_renders_tree_and_apply_legend ... ok
2026-07-29T09:52:37.8906638Z test picker::view::tests::choose_project_buffer_keeps_confirm_panel ... ok
2026-07-29T09:52:37.8940595Z test picker::view::tests::confirm_buffer_options ... ok
2026-07-29T09:52:37.8969728Z test picker::view::tests::confirm_fork_and_shortcut_labels_are_dir_relative ... ok
2026-07-29T09:52:37.9000840Z test picker::view::tests::confirm_panel_history_renders_display_not_slug ... ok
2026-07-29T09:52:37.9029115Z test picker::view::tests::create_home_lists_subnets ... ok
2026-07-29T09:52:37.9079576Z test picker::view::tests::footer_hints_h_s_only_when_launch_keys_live ... ok
2026-07-29T09:52:37.9096903Z test picker::view::tests::kind_buffer ... ok
2026-07-29T09:52:37.9132888Z test picker::view::tests::pick_buffer_has_squares_and_description ... ok
2026-07-29T09:52:37.9164977Z test picker::view::tests::pick_empty_category_hint ... ok
2026-07-29T09:52:37.9359786Z test picker::view::tests::pick_status_line_four_state ... ok
2026-07-29T09:52:37.9393995Z test picker::view::tests::resume_buffer_keeps_confirm_panel ... ok
2026-07-29T09:52:37.9425938Z test picker::view::tests::resume_buffer_lists_sessions ... ok
2026-07-29T09:52:47.9420379Z test cli::tests::shell_spawn_gates_on_the_registered_set ... ok
2026-07-29T09:52:47.9420798Z test rc::tests::attach_gate_routes_on_session_truth_not_the_row ... ok
2026-07-29T09:52:47.9454059Z test cli::tests::shell_spawn_profiled_option_resolves_and_shares_cap ... ok
2026-07-29T09:52:47.9574446Z test cli::tests::shutdown_and_stop_share_the_postcondition_and_differ_only_in_ceremony ... ok
2026-07-29T09:52:47.9575060Z test rc::tests::broker_host_child ... ok
2026-07-29T09:52:47.9575533Z test rc::tests::canonical_wire_id_strips_qualifiers_to_the_bare_id ... ok
2026-07-29T09:52:47.9576142Z test rc::tests::classify_read_err_eof_is_graceful_not_fatal ... ok
2026-07-29T09:52:47.9576887Z test rc::tests::detach_keybind_semantics ... ok
2026-07-29T09:52:47.9577503Z test rc::tests::detach_prefix_spans_chunks ... ok
2026-07-29T09:52:47.9578400Z test rc::tests::display_guard_postlude_exactly_once_and_inactive_silent ... ok
2026-07-29T09:52:47.9579063Z test rc::tests::driver_phrase_names_own_node_plainly_but_remote_verbatim ... ok
2026-07-29T09:52:47.9682268Z test cli::tests::shutdown_on_a_broker_hosted_endpoint_stamps_after_the_reap ... ok
2026-07-29T09:52:47.9682756Z test rc::tests::first_event_stall_decision ... ok
2026-07-29T09:52:47.9683376Z test rc::tests::give_up_copy_names_daemon_down_vs_generic ... ok
2026-07-29T09:52:47.9683967Z test rc::tests::harness_only_row_matches_online_seatless_live_agents_only ... ok
2026-07-29T09:52:47.9684669Z test rc::tests::identity_line_format ... ok
2026-07-29T09:52:47.9685541Z test rc::tests::mouse_mode_decset_scan_survives_split_across_chunks ... ok
2026-07-29T09:52:47.9686238Z test rc::tests::mouse_mode_decset_scan_tracks_enable_and_sgr ... ok
2026-07-29T09:52:47.9689358Z test rc::tests::op_minter_distinct_and_monotonic ... ok
2026-07-29T09:52:47.9690040Z test rc::tests::pre_broker_busy_guidance_fires_for_any_driver_not_just_remote ... ok
2026-07-29T09:52:47.9691231Z test rc::tests::public_attach_failure_maps_deadline_class_only ... ok
2026-07-29T09:52:47.9691879Z test rc::tests::pump_status_emit_sequence_over_write_sink ... ok
2026-07-29T09:52:47.9710478Z test cli::tests::shutdown_on_a_harness_hosted_endpoint_claims_no_process ... ok
2026-07-29T09:52:47.9711013Z test rc::tests::reassert_scanner_survives_split_across_chunks ... ok
2026-07-29T09:52:47.9711728Z test rc::tests::reassert_scanner_triggers_only_on_region_destroyers ... ok
2026-07-29T09:52:47.9712427Z test rc::tests::reconnect_banner_clears_and_centers ... ok
2026-07-29T09:52:47.9713091Z test rc::tests::reconnect_banner_shows_the_countdown ... ok
2026-07-29T09:52:47.9713802Z test rc::tests::reconnect_class_only_severed_transport_redrives ... ok
2026-07-29T09:52:47.9714521Z test rc::tests::reconnect_remaining_secs_counts_down_ceil ... ok
2026-07-29T09:52:47.9715138Z test rc::tests::reconnect_window_expiry_decision ... ok
2026-07-29T09:52:47.9715682Z test rc::tests::serve_eof_severed_vs_refused ... ok
2026-07-29T09:52:47.9716258Z test rc::tests::status_assert_reserves_row1_then_repaints ... ok
2026-07-29T09:52:47.9716921Z test rc::tests::status_repaint_exact_bytes_and_right_align ... ok
2026-07-29T09:52:47.9717408Z test rc::tests::status_restore_exact_bytes ... ok
2026-07-29T09:52:47.9717862Z test rc::tests::status_row_marker_is_disabled_by_flag ... ok
2026-07-29T09:52:47.9718363Z test rc::tests::status_update_size_repoints_geometry ... ok
2026-07-29T09:52:47.9719212Z test rc::tests::teardown_matrix_postlude_precedes_prose_across_every_final_class ... ok
2026-07-29T09:52:47.9855410Z test cli::tests::spt_hosted_no_relay_detection ... ok
2026-07-29T09:52:47.9929814Z test picker::data::tests::gather_endpoints_projects_from_seeded_index_with_zero_git ... ok
2026-07-29T09:52:47.9992803Z test picker::data::tests::gather_renders_live_unbound ... ok
2026-07-29T09:52:48.0315939Z test picker::data::tests::home_subnet_options_is_mru_ordered ... ok
2026-07-29T09:52:48.0327841Z test picker::data::tests::own_node_tab_label_falls_back_to_keyprefix ... ok
2026-07-29T09:52:48.0408533Z test picker::data::tests::picker_excludes_flat_worker_and_psyche ... ok
2026-07-29T09:52:48.0422005Z test picker::data::tests::remote_picker_renders_suspended_dead_perch_offline ... ok
2026-07-29T09:52:48.0422635Z test roster::tests::match_self_by_ancestry_disambiguates_and_none ... ok
2026-07-29T09:52:48.0437689Z test picker::data::tests::remote_rows_render_full_palette_parity ... ok
2026-07-29T09:52:48.0442528Z test picker::data::tests::resume_rows_title_from_index_cwd_map_with_pure_fallback ... ok
2026-07-29T09:52:48.0443154Z test teardown::tests::an_unconfirmed_row_over_a_dead_root_is_stale_not_a_survivor ... ok
2026-07-29T09:52:48.0458447Z test picker::data::tests::shared_machine_is_one_group_with_unioned_subnets ... ok
2026-07-29T09:52:48.0459152Z test teardown::tests::timeout_refuses_the_stamp_and_names_the_survivor ... ok
2026-07-29T09:52:48.0459745Z test teardown::tests::topology_gate_is_controllable_true_only ... ok
2026-07-29T09:52:48.0460412Z test tests::broken_pipe_panic_classifier ... ok
2026-07-29T09:52:48.0461624Z test wansend::tests::bare_id_resolves_across_remote_snapshot ... ok
2026-07-29T09:52:48.0462089Z test wansend::tests::classify_wan_reply_only_delivers_on_positive_outcomes ... ok
2026-07-29T09:52:48.0466592Z test wansend::tests::load_snapshots_degrades_on_junk ... ok
2026-07-29T09:52:48.0468223Z test wansend::tests::refusals_render_copy_paste_targets ... ok
2026-07-29T09:52:48.0591468Z test teardown::tests::liveness_proof_needs_a_real_snapshot_and_finds_this_process ... ok
2026-07-29T09:52:48.0592032Z test teardown::tests::a_zombie_root_is_provably_gone_not_a_survivor ... ok
2026-07-29T09:52:48.0661560Z test rc::tests::attach_against_stopped_daemon_never_spawns_and_exits_loud ... ok
2026-07-29T09:52:48.0678913Z test rc::tests::attach_offline_endpoint_short_circuits_clean ... ok
2026-07-29T09:52:48.0766108Z 
2026-07-29T09:52:48.0766433Z running 1 test
2026-07-29T09:52:48.1052300Z NTP_TOTP_UNCORRECTED: all NTP servers unreachable — ceremony clock = raw system clock
2026-07-29T09:52:48.1240021Z CONN_LIFECYCLE: conn=1 role=brain wall_ms=1785318768123 mono_ms=0 event=transport-close poisoned=false timed_out=false [REQ-CONN-POISON-ATTRIBUTION]
2026-07-29T09:52:48.1241081Z CONN_LIFECYCLE: conn=3 role=brain wall_ms=1785318768123 mono_ms=0 event=write-start [REQ-CONN-POISON-ATTRIBUTION]
2026-07-29T09:52:48.1255890Z CONN_LIFECYCLE: conn=2 role=brain controller session=1 endpoint=reheal by=local wall_ms=1785318768125 mono_ms=1 event=controller-attach session=1 from_seq=0 [REQ-CONN-POISON-ATTRIBUTION]
2026-07-29T09:52:48.1260470Z CONN_LIFECYCLE: conn=2 role=brain controller session=1 endpoint=reheal by=local wall_ms=1785318768125 mono_ms=2 event=write-start [REQ-CONN-POISON-ATTRIBUTION]
2026-07-29T09:52:48.1266531Z CONN_LIFECYCLE: conn=4 role=brain wall_ms=1785318768126 mono_ms=2 event=write-start [REQ-CONN-POISON-ATTRIBUTION]
2026-07-29T09:52:48.1285853Z CONN_LIFECYCLE: conn=4 role=brain stream-subscriber stream=2 wall_ms=1785318768128 mono_ms=4 event=stream-sub-attach stream=2 from_seq=0 [REQ-CONN-POISON-ATTRIBUTION]
2026-07-29T09:52:48.1753076Z CONN_LIFECYCLE: conn=5 role=brain wall_ms=1785318768175 mono_ms=51 event=write-start [REQ-CONN-POISON-ATTRIBUTION]
2026-07-29T09:52:48.1754131Z CONN_LIFECYCLE: conn=5 role=brain wall_ms=1785318768175 mono_ms=51 event=transport-close poisoned=false timed_out=false [REQ-CONN-POISON-ATTRIBUTION]
2026-07-29T09:52:48.1757332Z CONN_LIFECYCLE: conn=6 role=brain wall_ms=1785318768175 mono_ms=51 event=write-start [REQ-CONN-POISON-ATTRIBUTION]
2026-07-29T09:52:48.1759612Z CONN_LIFECYCLE: conn=6 role=brain stream-subscriber stream=1 wall_ms=1785318768175 mono_ms=52 event=stream-sub-attach stream=1 from_seq=0 [REQ-CONN-POISON-ATTRIBUTION]
2026-07-29T09:52:48.1762505Z CONN_LIFECYCLE: conn=6 role=brain stream-subscriber stream=1 viewer session=1 endpoint=reheal vid=0 wall_ms=1785318768176 mono_ms=52 event=viewer-attach session=1 vid=0 from_seq=0 [REQ-CONN-POISON-ATTRIBUTION]
2026-07-29T09:52:48.1764433Z SUBSCRIBE_DECISION: session=1 endpoint=reheal by=fd1724385aa0c75b64fb78cd602fa1d991fdebf76b13c58ed702eac835e9f618 conn=6 intent=viewer old_by=- old_gen=0 req_gen=0 decision=viewer
2026-07-29T09:52:48.1766125Z CONN_LIFECYCLE: conn=6 role=brain stream-subscriber stream=1 viewer session=1 endpoint=reheal vid=0 viewer session=1 endpoint=reheal vid=1 wall_ms=1785318768176 mono_ms=52 event=viewer-attach session=1 vid=1 from_seq=0 [REQ-CONN-POISON-ATTRIBUTION]
2026-07-29T09:52:48.1767939Z SUBSCRIBE_DECISION: session=1 endpoint=reheal by=fd1724385aa0c75b64fb78cd602fa1d991fdebf76b13c58ed702eac835e9f618 conn=6 intent=viewer old_by=- old_gen=0 req_gen=0 decision=viewer
2026-07-29T09:52:48.2323291Z 
2026-07-29T09:52:48.2323701Z running 1 test
2026-07-29T09:52:48.2563708Z NTP_TOTP_UNCORRECTED: all NTP servers unreachable — ceremony clock = raw system clock
2026-07-29T09:52:48.2797091Z CONN_LIFECYCLE: conn=1 role=brain wall_ms=1785318768279 mono_ms=0 event=transport-close poisoned=false timed_out=false [REQ-CONN-POISON-ATTRIBUTION]
2026-07-29T09:52:48.2798012Z CONN_LIFECYCLE: conn=3 role=brain wall_ms=1785318768279 mono_ms=0 event=write-start [REQ-CONN-POISON-ATTRIBUTION]
2026-07-29T09:52:48.2812098Z CONN_LIFECYCLE: conn=2 role=brain controller session=1 endpoint=reheal by=local wall_ms=1785318768281 mono_ms=1 event=controller-attach session=1 from_seq=0 [REQ-CONN-POISON-ATTRIBUTION]
2026-07-29T09:52:48.2817262Z CONN_LIFECYCLE: conn=2 role=brain controller session=1 endpoint=reheal by=local wall_ms=1785318768281 mono_ms=2 event=write-start [REQ-CONN-POISON-ATTRIBUTION]
2026-07-29T09:52:49.2334078Z CONN_LIFECYCLE: conn=4 role=brain wall_ms=1785318769233 mono_ms=953 event=write-start [REQ-CONN-POISON-ATTRIBUTION]
2026-07-29T09:52:49.2468231Z CONN_LIFECYCLE: conn=4 role=brain stream-subscriber stream=2 wall_ms=1785318769246 mono_ms=967 event=stream-sub-attach stream=2 from_seq=0 [REQ-CONN-POISON-ATTRIBUTION]
2026-07-29T09:52:49.2864717Z CONN_LIFECYCLE: conn=5 role=brain wall_ms=1785318769286 mono_ms=1006 event=write-start [REQ-CONN-POISON-ATTRIBUTION]
2026-07-29T09:52:49.2865633Z CONN_LIFECYCLE: conn=5 role=brain wall_ms=1785318769286 mono_ms=1006 event=transport-close poisoned=false timed_out=false [REQ-CONN-POISON-ATTRIBUTION]
2026-07-29T09:52:49.2868046Z CONN_LIFECYCLE: conn=6 role=brain wall_ms=1785318769286 mono_ms=1007 event=write-start [REQ-CONN-POISON-ATTRIBUTION]
2026-07-29T09:52:49.2870179Z CONN_LIFECYCLE: conn=6 role=brain stream-subscriber stream=1 wall_ms=1785318769286 mono_ms=1007 event=stream-sub-attach stream=1 from_seq=0 [REQ-CONN-POISON-ATTRIBUTION]
2026-07-29T09:52:49.2873234Z CONN_LIFECYCLE: conn=6 role=brain stream-subscriber stream=1 viewer session=1 endpoint=reheal vid=0 wall_ms=1785318769287 mono_ms=1007 event=viewer-attach session=1 vid=0 from_seq=0 [REQ-CONN-POISON-ATTRIBUTION]
2026-07-29T09:52:49.2874846Z SUBSCRIBE_DECISION: session=1 endpoint=reheal by=fd1724385aa0c75b64fb78cd602fa1d991fdebf76b13c58ed702eac835e9f618 conn=6 intent=viewer old_by=- old_gen=0 req_gen=0 decision=viewer
2026-07-29T09:52:49.2876570Z CONN_LIFECYCLE: conn=6 role=brain stream-subscriber stream=1 viewer session=1 endpoint=reheal vid=0 viewer session=1 endpoint=reheal vid=1 wall_ms=1785318769287 mono_ms=1007 event=viewer-attach session=1 vid=1 from_seq=0 [REQ-CONN-POISON-ATTRIBUTION]
2026-07-29T09:52:49.2878740Z SUBSCRIBE_DECISION: session=1 endpoint=reheal by=fd1724385aa0c75b64fb78cd602fa1d991fdebf76b13c58ed702eac835e9f618 conn=6 intent=viewer old_by=- old_gen=0 req_gen=0 decision=viewer
2026-07-29T09:52:49.6350217Z CONN_LIFECYCLE: conn=6 role=brain stream-subscriber stream=1 viewer session=1 endpoint=reheal vid=0 viewer session=1 endpoint=reheal vid=1 wall_ms=1785318769634 mono_ms=1355 event=writer-exit role=viewer session=1 reason=channel-closed [REQ-CONN-POISON-ATTRIBUTION]
2026-07-29T09:52:49.6351967Z CONN_LIFECYCLE: conn=2 role=brain controller session=1 endpoint=reheal by=local wall_ms=1785318769634 mono_ms=1355 event=writer-exit role=controller session=1 reason=channel-closed [REQ-CONN-POISON-ATTRIBUTION]
2026-07-29T09:52:49.6353923Z CONN_LIFECYCLE: conn=6 role=brain stream-subscriber stream=1 viewer session=1 endpoint=reheal vid=0 viewer session=1 endpoint=reheal vid=1 wall_ms=1785318769634 mono_ms=1355 event=writer-exit role=viewer session=1 reason=channel-closed [REQ-CONN-POISON-ATTRIBUTION]
2026-07-29T09:52:49.6355453Z CONN_LIFECYCLE: conn=6 role=brain stream-subscriber stream=1 viewer session=1 endpoint=reheal vid=0 viewer session=1 endpoint=reheal vid=1 wall_ms=1785318769634 mono_ms=1355 event=stream-sub-release stream=1 [REQ-CONN-POISON-ATTRIBUTION]
2026-07-29T09:52:49.6356759Z CONN_LIFECYCLE: conn=7 role=brain wall_ms=1785318769635 mono_ms=1355 event=transport-close poisoned=false timed_out=false [REQ-CONN-POISON-ATTRIBUTION]
2026-07-29T09:52:49.6358039Z CONN_LIFECYCLE: conn=6 role=brain stream-subscriber stream=1 viewer session=1 endpoint=reheal vid=0 viewer session=1 endpoint=reheal vid=1 wall_ms=1785318769635 mono_ms=1355 event=transport-close poisoned=false timed_out=false [REQ-CONN-POISON-ATTRIBUTION]
2026-07-29T09:52:49.6384027Z test rc::tests::attach_viewport_reconnects_across_a_broker_bounce ... ok
2026-07-29T09:52:49.6941159Z test rc::tests::establish_attach_reuses_the_probes_carried_pump_conn ... ok
2026-07-29T09:52:51.1312317Z test rc::tests::qualified_targets_attach_with_bare_wire_id ... ok
2026-07-29T09:52:51.1334897Z test roster::tests::detect_self_by_ancestry_none_when_no_ancestor_owns_a_perch ... ok
2026-07-29T09:52:51.1412719Z test roster::tests::detect_self_by_ancestry_resolves_a_live_ancestor_perch ... ok
2026-07-29T09:52:51.1443533Z test roster::tests::detect_self_id_endpoint_id_leg_is_label_only_and_perch_gated ... ok
2026-07-29T09:52:51.1578677Z test roster::tests::detect_self_id_resolves_identity_with_zero_git_spawns ... ok
2026-07-29T09:52:51.1610319Z test roster::tests::detect_self_resolves_spt_hosted_perch_via_parent_pid ... ok
2026-07-29T09:52:51.1613625Z test roster::tests::enumerate_yields_offline_corrupt_row_for_unparseable_info ... ok
2026-07-29T09:52:51.1659272Z test roster::tests::list_all_perch_dirs_enumerates_nested_psyche_for_self_resolution ... ok
2026-07-29T09:52:51.1714031Z test roster::tests::parent_pid_candidates_stay_ancestry_gated ... ok
2026-07-29T09:52:51.3833379Z test wansend::tests::remote_rest_suspends_and_wakes_with_the_deferred_gate ... ok
2026-07-29T09:52:51.4060962Z test wansend::tests::resolve_and_dial_owner_dials_the_resolved_node ... ok
2026-07-29T09:52:51.4124500Z test wansend::tests::resolve_and_dial_owner_is_honest_on_resolution_misses ... ok
2026-07-29T09:52:51.4127105Z test wansend::tests::seed_first_addr_prefers_the_cached_direct_address ... ok
2026-07-29T09:52:51.4648458Z test wansend::tests::wan_send_ships_to_the_resolved_node ... ok
2026-07-29T09:52:51.4648806Z 
2026-07-29T09:52:51.4648910Z failures:
2026-07-29T09:52:51.4649158Z 
2026-07-29T09:52:51.4649388Z ---- cli::tests::adapter_translate_proof_gates_on_commit stdout ----
2026-07-29T09:52:51.4649703Z 
2026-07-29T09:52:51.4650097Z thread 'cli::tests::adapter_translate_proof_gates_on_commit' (2681741) panicked at crates/spt/src/cli.rs:17011:13:
2026-07-29T09:52:51.4651200Z translate_proof_fixture must be built: /home/reavus/actions-runner/_work/spt-bs-core/spt-bs-core/target/debug/translate_proof_fixture (run via `cargo test -p spt`)
2026-07-29T09:52:51.4651945Z note: run with `RUST_BACKTRACE=1` environment variable to display a backtrace
2026-07-29T09:52:51.4652213Z 
2026-07-29T09:52:51.4652236Z 
2026-07-29T09:52:51.4652359Z failures:
2026-07-29T09:52:51.4652669Z     cli::tests::adapter_translate_proof_gates_on_commit
2026-07-29T09:52:51.4652960Z 
2026-07-29T09:52:51.4653296Z test result: FAILED. 448 passed; 1 failed; 0 ignored; 0 measured; 0 filtered out; finished in 30.98s
2026-07-29T09:52:51.4653630Z 
2026-07-29T09:52:51.4721466Z error: test failed, to rerun pass `-p spt --bin spt`
2026-07-29T09:52:51.4843913Z ##[error]Process completed with exit code 101.
2026-07-29T09:52:51.4955943Z Post job cleanup.
2026-07-29T09:52:51.5662967Z [command]/usr/bin/git version
2026-07-29T09:52:51.5694399Z git version 2.43.0
2026-07-29T09:52:51.5760685Z Temporarily overriding HOME='/home/reavus/actions-runner/_work/_temp/ff3227dc-11fa-41d6-94e6-50fc05060cd5' before making global git config changes
2026-07-29T09:52:51.5761819Z Adding repository directory to the temporary git global config as a safe directory
2026-07-29T09:52:51.5765104Z [command]/usr/bin/git config --global --add safe.directory /home/reavus/actions-runner/_work/spt-bs-core/spt-bs-core
2026-07-29T09:52:51.5795963Z [command]/usr/bin/git config --local --name-only --get-regexp core\.sshCommand
2026-07-29T09:52:51.5824322Z [command]/usr/bin/git submodule foreach --recursive sh -c "git config --local --name-only --get-regexp 'core\.sshCommand' && git config --local --unset-all 'core.sshCommand' || :"
2026-07-29T09:52:51.6011165Z [command]/usr/bin/git config --local --name-only --get-regexp http\.https\:\/\/github\.com\/\.extraheader
2026-07-29T09:52:51.6030206Z http.https://github.com/.extraheader
2026-07-29T09:52:51.6037424Z [command]/usr/bin/git config --local --unset-all http.https://github.com/.extraheader
2026-07-29T09:52:51.6063928Z [command]/usr/bin/git submodule foreach --recursive sh -c "git config --local --name-only --get-regexp 'http\.https\:\/\/github\.com\/\.extraheader' && git config --local --unset-all 'http.https://github.com/.extraheader' || :"
2026-07-29T09:52:51.6250929Z [command]/usr/bin/git config --local --name-only --get-regexp ^includeIf\.gitdir:
2026-07-29T09:52:51.6274774Z [command]/usr/bin/git submodule foreach --recursive git config --local --show-origin --name-only --get-regexp remote.origin.url
2026-07-29T09:52:51.6594588Z Cleaning up orphan processes
